{"text_format":"1","workbook":"xlsx","n_sheets":16,"sheets":["HOME","INSTRUCCIONES","INSCRIPCIONES","INSCRIPCIONES MIXTO","USUARIOS","NIVEL ACCESO","DATOS DEPORTISTAS","CLUBS","ENTRE_DELEG","CENTRO NATACION HELIOS","NAUTICO ZARAGOZA","OS NABATERS","CAPRI MEQUINENZA","ARAGON REMO","REMO ZARAGOZA","COMPETICIONES2026"],"not_rendered":{"charts":0,"images":13,"macros":1,"external_links":0,"defined_names":91,"comments":2,"pivot_tables":0},"unopened":[],"bounds":{"document_bytes":16777216,"sheet_cells":100000,"rows_first":2000,"rows_last":500,"rows_between":2000,"halvings":0,"cell_chars":16384,"cell_head_chars":4096},"cells_cut":0,"cells_raw":0,"read":"whole","date_system":"1900"}

{"sheet":"HOME","index":0,"n_rows":21,"n_cols":5,"rows_kept":21,"cut":false,"hidden":false,"merged":[[1,2,2,4],[12,6,12,7],[20,3,20,8],[14,6,14,7]]}
[]
[]
[]
[]
[]
[]
[]
[]
[]
[]
[]
[]
[null,null,null,null,"USUARIO"]
[]
[null,null,null,null,"CONTRASEÑA"]
[]
[]
[]
[]
[]
[null,null,null,{"$f":"IF($G$15=\"\",\"Introduzca Usuario y Contraseña\",IF(USUARIOS!$E$4=FALSE,\"El usuario Ingresado No Existe o la Contraseña Ingresada es Incorrecta\",\"Bienvenido al Sistema\"))","v":"Introduzca Usuario y Contraseña"}]

{"sheet":"INSTRUCCIONES","index":1,"n_rows":66,"n_cols":11,"rows_kept":66,"cut":false,"hidden":false,"merged":[[11,7,13,16],[43,7,45,17]]}
[]
[]
[]
[]
[]
[]
[]
[]
[]
[]
[]
[null,null,null,null,null,null,null,"INSTRUCCIONES RELLENAR HOJA DE INSCRIPCIONES (ir pinchando en cada una de las etiquetas)"]
[]
[]
[null,null,null,null,null,null,null,0,"NUMERACION",null,"SELECCIONE EL NUMERO DE HOJA SEGÚN LA CANTIDAD DE INSCRIPCIONES QUE VAYA A REALIZAR"]
[null,null,null,null,null,null,null,1,"CLUB",null,"EN LA HOJA DE INSCRIPCIONES APARECE AUTOMATICAMENTE"]
[null,null,null,null,null,null,null,2,"COMPETICION",null,"SELECCIONAR DEL DESPLEGABLE"]
[null,null,null,null,null,null,null,3,"LUGAR",null,"RELLENAR DATOS DEL LUGAR DE LA COMPETICION"]
[null,null,null,null,null,null,null,4,"UNIFORME",null,"EN LA HOJA DE INSCRIPCIONES APARECE AUTOMATICAMENTE"]
[null,null,null,null,null,null,null,5,"SELEC. CATEGORIA",null,"SELECCIONE DE ESTA COLUMNA LA CATEGORIA DEL DEPORTISTA"]
[null,null,null,null,null,null,null,6,"NOMBRE",null,"SELECCIONE AL DEPORTISTA"]
[null,null,null,null,null,null,null,7,"CATEGORIA",null,"EN LA HOJA DE INSCRIPCIONES APARECE AUTOMATICAMENTE"]
[null,null,null,null,null,null,null,8,"MODALIDAD",null,"SELECCIONAR DEL DESPLEGABLE"]
[null,null,null,null,null,null,null,9,"EDAD",null,"EN LA HOJA DE INSCRIPCIONES APARECE AUTOMATICAMENTE"]
[null,null,null,null,null,null,null,10,"PUESTO",null,"SELECCIONAR DEL DESPLEGABLE"]
[null,null,null,null,null,null,null,11,"EMBARCACIÓN",null,"SELECCIONAR DEL DESPLEGABLE"]
[null,null,null,null,null,null,null,12,"Nº FICHA",null,"EN LA HOJA DE INSCRIPCIONES APARECE AUTOMATICAMENTE"]
[null,null,null,null,null,null,null,13,"ENTRENADOR",null,"SELECCIONAR DEL DESPLEGABLE"]
[null,null,null,null,null,null,null,14,"D.N.I. ENTRENADOR",null,"EN LA HOJA DE INSCRIPCIONES APARECE AUTOMATICAMENTE"]
[null,null,null,null,null,null,null,15,"CATEGORIA ENTRENADOR",null,"SELECCIONAR DEL DESPLEGABLE"]
[null,null,null,null,null,null,null,16,"DELEGADO",null,"SELECCIONAR DEL DESPLEGABLE"]
[null,null,null,null,null,null,null,17,"D.N.I. DELEGADO",null,"EN LA HOJA DE INSCRIPCIONES APARECE AUTOMATICAMENTE"]
[null,null,null,null,null,null,null,18,"FIRMA Y FECHA",null,"RELLENE LOS DATOS DE FIRMA, LUGAR Y FECHA DE REALIZACION DE LA INSCRIPCION"]
[]
[]
[]
[]
[]
[]
[]
[]
[]
[]
[null,null,null,null,null,null,null,"INSTRUCCIONES RELLENAR HOJA DE INSCRIPCIONES MIXTO (ir pinchando en cada una de las etiquetas)"]
[]
[]
[null,null,null,null,null,null,null,0,"NUMERACION",null,"SELECCIONE EL NUMERO DE HOJA SEGÚN LA CANTIDAD DE INSCRIPCIONES QUE VAYA A REALIZAR"]
[null,null,null,null,null,null,null,1,"CLUB",null,"EN LA HOJA DE INSCRIPCIONES APARECE AUTOMATICAMENTE"]
[null,null,null,null,null,null,null,2,"COMPETICION",null,"SELECCIONAR DEL DESPLEGABLE"]
[null,null,null,null,null,null,null,3,"LUGAR",null,"RELLENAR DATOS DEL LUGAR DE LA COMPETICION"]
[null,null,null,null,null,null,null,4,"UNIFORME",null,"EN LA HOJA DE INSCRIPCIONES MIXTO RELLENAR"]
[null,null,null,null,null,null,null,5,"SELECCION CLUB",null,"SELECCIONE DE ESTA COLUMNA EL CLUB DEL DEPORTISTA"]
[null,null,null,null,null,null,null,6,"SELECCION CATEGORIA",null,"SELECCIONE DE ESTA COLUMNA LA CATEGORIA DEL DEPORTISTA"]
[null,null,null,null,null,null,null,7,"NOMBRE",null,"EN LA HOJA DE INSCRIPCIONES MIXTO SELECCIONE DEL DESPLEGABLE"]
[null,null,null,null,null,null,null,8,"CATEGORIA",null,"EN LA HOJA DE INSCRIPCIONES MIXTO APARECE AUTOMATICAMENTE"]
[null,null,null,null,null,null,null,9,"MODALIDAD",null,"EN LA HOJA DE INSCRIPCIONES MIXTO SELECCIONAR DEL DESPLEGABLE"]
[null,null,null,null,null,null,null,10,"EDAD",null,"EN LA HOJA DE INSCRIPCIONES MIXTO APARECE AUTOMATICAMENTE"]
[null,null,null,null,null,null,null,11,"PUESTO",null,"EN LA HOJA DE INSCRIPCIONES  MIXTO  SELECCIONAR DEL DESPLEGABLE"]
[null,null,null,null,null,null,null,12,"EMBARCACION",null,"EN LA HOJA DE INSCRIPCIONES  MIXTO SELECCIONAR DEL DESPLEGABLE"]
[null,null,null,null,null,null,null,13,"Nº FICHA",null,"EN LA HOJA DE INSCRIPCIONES MIXTO APARECE AUTOMATICAMENTE"]
[null,null,null,null,null,null,null,14,"ENTRENADOR",null,"EN LA HOJA DE INSCRIPCIONES MIXTO SELEECIONE DEL DESPLEGABLE"]
[null,null,null,null,null,null,null,15,"D.N.I. ENTRENADOR",null,"EN LA HOJA DE INSCRIPCIONES MIXTO APARECE AUTOMATICAMENTE"]
[null,null,null,null,null,null,null,16,"CATEGORIA ENTRENADOR",null,"SELECCIONAR DEL DESPLEGABLE"]
[null,null,null,null,null,null,null,17,"DELEGADO",null,"EN LA HOJA DE INSCRIPCIONES MIXTO SELECCIONE DEL DESPLEGABLE"]
[null,null,null,null,null,null,null,18,"D.N.I. DELEGADO",null,"EN LA HOJA DE INSCRIPCIONES MIXTO APARECE AUTOMATICAMENTE"]
[null,null,null,null,null,null,null,19,"FIRMA Y FECHA",null,"RELLENE LOS DATOS DE FIRMA, LUGAR Y FECHA DE REALIZACION DE LA INSCRIPCION"]

{"sheet":"INSCRIPCIONES","index":2,"n_rows":50,"n_cols":70,"rows_kept":50,"cut":false,"hidden":true,"merged":[[5,18,5,22],[5,9,5,12],[7,23,7,49],[9,9,9,49],[11,15,11,49],[13,12,13,27],[13,37,13,49],[17,11,17,26],[17,33,17,49],[20,45,20,50],[21,0,21,8],[21,9,21,15],[21,16,21,18],[21,19,21,20],[21,21,21,36],[21,37,21,44],[21,45,21,50],[20,0,20,8],[20,9,20,15],[20,16,20,18],[20,19,20,20],[20,21,20,36],[20,37,20,44],[21,53,21,63],[22,0,22,8],[22,9,22,15],[22,16,22,18],[22,19,22,20],[22,21,22,36],[22,37,22,44],[22,45,22,50],[22,53,22,63],[23,45,23,50],[23,53,23,63],[24,0,24,8],[24,9,24,15],[24,16,24,18],[24,19,24,20],[24,21,24,36],[24,37,24,44],[24,45,24,50],[24,53,24,63],[23,0,23,8],[23,9,23,15],[23,16,23,18],[23,19,23,20],[23,21,23,36],[23,37,23,44],[25,45,25,50],[25,53,25,63],[26,0,26,8],[26,9,26,15],[26,16,26,18],[26,19,26,20],[26,21,26,36],[26,37,26,44],[26,45,26,50],[26,53,26,63],[25,0,25,8],[25,9,25,15],[25,16,25,18],[25,19,25,20],[25,21,25,36],[25,37,25,44],[27,45,27,50],[27,53,27,63],[28,0,28,8],[28,9,28,15],[28,16,28,18],[28,19,28,20],[28,21,28,36],[28,37,28,44],[28,45,28,50],[28,53,28,63],[27,0,27,8],[27,9,27,15],[27,16,27,18],[27,19,27,20],[27,21,27,36],[27,37,27,44],[29,45,29,50],[29,53,29,63],[30,0,30,8],[30,9,30,15],[30,16,30,18],[30,19,30,20],[30,21,30,36],[30,37,30,44],[30,45,30,50],[30,53,30,63],[29,0,29,8],[29,9,29,15],[29,16,29,18],[29,19,29,20],[29,21,29,36],[29,37,29,44],[31,45,31,50],[31,53,31,63],[32,0,32,8],[32,9,32,15],[32,16,32,18],[32,19,32,20],[32,21,32,36],[32,37,32,44],[32,45,32,50],[32,53,32,63],[31,0,31,8],[31,9,31,15],[31,16,31,18],[31,19,31,20],[31,21,31,36],[31,37,31,44],[33,45,33,50],[33,53,33,63],[34,0,34,8],[34,9,34,15],[34,16,34,18],[34,19,34,20],[34,21,34,36],[34,37,34,44],[34,45,34,50],[34,53,34,63],[33,0,33,8],[33,9,33,15],[33,16,33,18],[33,19,33,20],[33,21,33,36],[33,37,33,44],[35,45,35,50],[35,53,35,63],[36,0,36,8],[36,9,36,15],[36,16,36,18],[36,19,36,20],[36,21,36,36],[36,37,36,44],[36,45,36,50],[36,53,36,63],[35,0,35,8],[35,9,35,15],[35,16,35,18],[35,19,35,20],[35,21,35,36],[35,37,35,44],[47,20,47,30],[47,32,47,33],[47,34,47,35],[47,36,47,45],[47,47,47,49],[37,45,37,50],[37,53,37,63],[40,7,40,30],[40,37,40,49],[42,7,42,33],[44,7,44,30],[44,37,44,49],[37,0,37,8],[37,9,37,15],[37,16,37,18],[37,19,37,20],[37,21,37,36],[37,37,37,44],[40,53,40,63]]}
[]
[null,null,null,null,null,null,null,null,null,null,null,null,null,null,null,null,null,null,null,null,null,null,null,null,"FEDERACIÓN ARAGONESA DE REMO"]
[null,null,null,null,null,null,null,null,null,null,null,null,null,null,"Hoja de inscripción oficial"]
[]
[]
[null,null,null,"Nº DE HOJA",null,null,null,null,null,1,null,null,null,null,null,"DE",null,null,1,null,null,null,null,null,null,null,null,null,null,null,null,null,null,null,null,null,null,null,null,null,null,null,null,null,null,null,null,null,null,null,null,null,null,null,null,null,null,null,null,null,null,null,null,null,null,null,null,null,null,{"$f":"IF(X8=\"CENTRO NATACION HELIOS\",\"TECNICOS_HELIOS\",IF(X8=\"NAUTICO ZARAGOZA\",\"TECNICOS_NAUTICO_ZARAGOZA\",IF(X8=\"OS NABATERS D.F.\",\"TECNICOS_OS_NABATERS_D._F.\",IF(X8=\"REMO ZARAGOZA\",\"TECNICOS_REMO_ZARAGOZA\",IF(X8=\"CAPRI MEQUINENZA\",\"TECNICOS_CAPRI_MEQUINENZA\",IF(X8=\"ARAGON REMO\",\"TECNICOS_ARAGON_REMO\",IF(X8=\"REMO MEQUINENZA\",\"TECNICOS_REMO_MEQUINENZA\")))))))","v":false}]
[]
[null,"Hoja de Inscripción que formula el Club:",null,null,null,null,null,null,null,null,null,null,null,null,null,null,null,null,null,null,null,null,null,{"$f":"HOME!G13","v":0},null,null,null,null,null,null,null,null,null,null,null,null,null,null,null,null,null,null,null,null,null,null,null,null,null,null,null,null,null,null,null,null,null,null,null,null,null,null,null,null,null,null,null,null,null,{"$f":"IF(X8=\"CENTRO NATACION HELIOS\",\"DELEGADOS_HELIOS\",IF(X8=\"NAUTICO ZARAGOZA\",\"DELEGADO_NAUTICO_ZARAGOZA\",IF(X8=\"OS NABATERS D.F.\",\"DELEGADOS_OS_NABATERS_D._F.\",IF(X8=\"REMO ZARAGOZA\",\"DELEGADOS_REMO_ZARAGOZA\",IF(X8=\"CAPRI MEQUINENZA\",\"DELEGADOS_CAPRI_MEQUINENZA\",IF(X8=\"ARAGON REMO\",\"DELEGADOS_ARAGON_REMO\",IF(X8=\"REMO MEQUINENZA\",\"DELEGADOS_REMO_MEQUINENZA\")))))))","v":false}]
[]
[null,"Adscrito a la,",null,null,null,null,null,null,null,"FEDERACIÓN ARAGONESA DE REMO"]
[]
[null,"para PARTICIPAR en, "]
[]
[null,"que se celebrará en ",null,null,null,null,null,null,null,null,null,null,null,null,null,null,null,null,null,null,null,null,null,null,null,null,null,null,null,"durante los dias"]
[]
[null,"INSCRIBE a los equipos más abajo indicados"]
[]
[null,"Colores: Uniforme:",null,null,null,null,null,null,null,null,null,{"$f":"IF(X8=\"ARAGON REMO\",\"AMARILLO Y ROJO\",IF(X8=\"CAPRI MEQUINENZA\",\"ROJO Y BLANCO\",IF(X8=\"CENTRO NATACION HELIOS\",\"AZUL Y BLANCO\",IF(X8=\"NAUTICO ZARAGOZA\",\"ROJO\",IF(X8=\"OS NABATERS D.F.\",\"AMARILLO Y VERDE\",IF(X8=\"REMO MEQUINENZA\",\"ROJO Y BLANCO\",IF(X8=\"REMO ZARAGOZA\",\"ROJO Y BLANCO\"\"\")))))))","v":false},null,null,null,null,null,null,null,null,null,null,null,null,null,null,null,null,null,null,null,null,null,{"$f":"IF(X8=\"ARAGON REMO\",\"AMARILLO Y ROJO\",IF(X8=\"CAPRI MEQUINENZA\",\"ROJO Y BLANCO\",IF(X8=\"CENTRO NATACION HELIOS\",\"AZUL Y BLANCO\",IF(X8=\"NAUTICO ZARAGOZA\",\"ROJO\",IF(X8=\"OS NABATERS D.F.\",\"AMARILLO Y VERDE\",IF(X8=\"REMO MEQUINENZA\",\"ROJO Y BLANCO\",IF(X8=\"REMO ZARAGOZA\",\"ROJO Y BLANCO\"\"\")))))))","v":false}]
[]
[]
["CATEGORIA",null,null,null,null,null,null,null,null,"Modalidad",null,null,null,null,null,null,"Edad",null,null,"Pto",null,"NOMBRE, APELLIDOS",null,null,null,null,null,null,null,null,null,null,null,null,null,null,null,"SEXO",null,null,null,null,null,null,null,"Nº FICHA."]
[{"$f":"IF(BB22=\"BENJAMIN\",\"BENJAMIN\",IF(BB22=\"ALEVIN\",\"ALEVIN\",IF(BB22=\"INFANTIL\",\"INFANTIL\",IF(BB22=\"CADETE\",\"CADETE\",IF(BB22=\"JUVENIL\",\"JUVENIL\",IF(BB22=\"SENIOR\",\"SENIOR\",IF(BB22=\"VETERANO\",\"VETERANO\",IF(BB22=\"BENJAMIN_NZ\",\"BENJAMIN\",IF(BB22=\"ALEVIN_NZ\",\"ALEVIN\",IF(BB22=\"INFANTIL_NZ\",\"INFANTIL\",IF(BB22=\"CADETE_NZ\",\"CADETE\",IF(BB22=\"JUVENIL_NZ\",\"JUVENIL\",IF(BB22=\"SENIOR_NZ\",\"SENIOR\",IF(BB22=\"VETERANO_NZ\",\"VETERANO\",IF(BB22=\"ALEVIN_NB\",\"ALEVIN\",IF(BB22=\"INFANTIL_NB\",\"INFANTIL\",IF(BB22=\"CADETE_NB\",\"CADETE\",IF(BB22=\"JUVENIL_NB\",\"JUVENIL\",IF(BB22=\"SENIOR_NB\",\"SENIOR\",IF(BB22=\"VETERANO_NB\",\"VETERANO\",IF(BB22=\"BENJAMIN_CM\",\"BENJAMIN\",IF(BB22=\"ALEVIN_CM\",\"ALEVIN\",IF(BB22=\"INFANTIL_CM\",\"INFANTIL\",IF(BB22=\"CADETE_CM\",\"CADETE\",IF(BB22=\"JUVENIL_CM\",\"JUVENIL\",IF(BB22=\"SENIOR_CM\",\"SENIOR\",IF(BB22=\"VETERANO_CM\",\"VETERANO\",IF(BB22=\"BENJAMIN_AR\",\"BENJAMIN\",IF(BB22=\"ALEVIN_AR\",\"ALEVIN\",IF(BB22=\"INFANTIL_AR\",\"INFANTIL\",IF(BB22=\"CADETE_AR\",\"CADETE\",IF(BB22=\"JUVENIL_AR\",\"JUVENIL\",IF(BB22=\"SENIOR_AR\",\"SENIOR\",IF(BB22=\"VETERANO_AR\",\"VETERANO\",IF(BB22=\"BENJAMIN_RZ\",\"BENJAMIN\",IF(BB22=\"ALEVIN_RZ\",\"ALEVIN\",IF(BB22=\"INFANTIL_RZ\",\"INFANTIL\",IF(BB22=\"CADETE_RZ\",\"CADETE\",IF(BB22=\"JUVENIL_RZ\",\"JUVENIL\",IF(BB22=\"SENIOR_RZ\",\"SENIOR\",IF(BB22=\"VETERANO_RZ\",\"VETERANO\",\"\")))))))))))))))))))))))))))))))))))))))))","v":""},null,null,null,null,null,null,null,null,null,null,null,null,null,null,null,{"$f":"IF(_xlfn.XLOOKUP(V22,'DATOS DEPORTISTAS'!$M$24:$M$646,'DATOS DEPORTISTAS'!$Q$24:$Q$646,\"\")<30,\"\",(_xlfn.XLOOKUP(V22,'DATOS DEPORTISTAS'!$M$24:$M$646,'DATOS DEPORTISTAS'!$Q$24:$Q$646,\"\")))","v":""},null,null,null,null,null,null,null,null,null,null,null,null,null,null,null,null,null,null,null,null,{"$f":"_xlfn.XLOOKUP(V22,'DATOS DEPORTISTAS'!$M$24:$M$646,'DATOS DEPORTISTAS'!$J$24:$J$646,\"\")","v":0},null,null,null,null,null,null,null,{"$f":"_xlfn.XLOOKUP(V22,'DATOS DEPORTISTAS'!$M$24:$M$646,'DATOS DEPORTISTAS'!$U$24:$U$646,\"\")","v":0}]
[{"$f":"IF(BB23=\"BENJAMIN\",\"BENJAMIN\",IF(BB23=\"ALEVIN\",\"ALEVIN\",IF(BB23=\"INFANTIL\",\"INFANTIL\",IF(BB23=\"CADETE\",\"CADETE\",IF(BB23=\"JUVENIL\",\"JUVENIL\",IF(BB23=\"SENIOR\",\"SENIOR\",IF(BB23=\"VETERANO\",\"VETERANO\",IF(BB23=\"BENJAMIN_NZ\",\"BENJAMIN\",IF(BB23=\"ALEVIN_NZ\",\"ALEVIN\",IF(BB23=\"INFANTIL_NZ\",\"INFANTIL\",IF(BB23=\"CADETE_NZ\",\"CADETE\",IF(BB23=\"JUVENIL_NZ\",\"JUVENIL\",IF(BB23=\"SENIOR_NZ\",\"SENIOR\",IF(BB23=\"VETERANO_NZ\",\"VETERANO\",IF(BB23=\"ALEVIN_NB\",\"ALEVIN\",IF(BB23=\"INFANTIL_NB\",\"INFANTIL\",IF(BB23=\"CADETE_NB\",\"CADETE\",IF(BB23=\"JUVENIL_NB\",\"JUVENIL\",IF(BB23=\"SENIOR_NB\",\"SENIOR\",IF(BB23=\"VETERANO_NB\",\"VETERANO\",IF(BB23=\"BENJAMIN_CM\",\"BENJAMIN\",IF(BB23=\"ALEVIN_CM\",\"ALEVIN\",IF(BB23=\"INFANTIL_CM\",\"INFANTIL\",IF(BB23=\"CADETE_CM\",\"CADETE\",IF(BB23=\"JUVENIL_CM\",\"JUVENIL\",IF(BB23=\"SENIOR_CM\",\"SENIOR\",IF(BB23=\"VETERANO_CM\",\"VETERANO\",IF(BB23=\"BENJAMIN_AR\",\"BENJAMIN\",IF(BB23=\"ALEVIN_AR\",\"ALEVIN\",IF(BB23=\"INFANTIL_AR\",\"INFANTIL\",IF(BB23=\"CADETE_AR\",\"CADETE\",IF(BB23=\"JUVENIL_AR\",\"JUVENIL\",IF(BB23=\"SENIOR_AR\",\"SENIOR\",IF(BB23=\"VETERANO_AR\",\"VETERANO\",IF(BB23=\"BENJAMIN_RZ\",\"BENJAMIN\",IF(BB23=\"ALEVIN_RZ\",\"ALEVIN\",IF(BB23=\"INFANTIL_RZ\",\"INFANTIL\",IF(BB23=\"CADETE_RZ\",\"CADETE\",IF(BB23=\"JUVENIL_RZ\",\"JUVENIL\",IF(BB23=\"SENIOR_RZ\",\"SENIOR\",IF(BB23=\"VETERANO_RZ\",\"VETERANO\",\"\")))))))))))))))))))))))))))))))))))))))))","v":""},null,null,null,null,null,null,null,null,null,null,null,null,null,null,null,{"$f":"IF(_xlfn.XLOOKUP(V23,'DATOS DEPORTISTAS'!$M$24:$M$646,'DATOS DEPORTISTAS'!$Q$24:$Q$646,\"\")<30,\"\",(_xlfn.XLOOKUP(V23,'DATOS DEPORTISTAS'!$M$24:$M$646,'DATOS DEPORTISTAS'!$Q$24:$Q$646,\"\")))","v":""},null,null,null,null,null,null,null,null,null,null,null,null,null,null,null,null,null,null,null,null,{"$f":"_xlfn.XLOOKUP(V23,'DATOS DEPORTISTAS'!$M$24:$M$646,'DATOS DEPORTISTAS'!$J$24:$J$646,\"\")","v":0},null,null,null,null,null,null,null,{"$f":"_xlfn.XLOOKUP(V23,'DATOS DEPORTISTAS'!$M$24:$M$646,'DATOS DEPORTISTAS'!$U$24:$U$646,\"\")","v":0}]
["",null,null,null,null,null,null,null,null,null,null,null,null,null,null,null,{"$f":"IF(_xlfn.XLOOKUP(V24,'DATOS DEPORTISTAS'!$M$24:$M$646,'DATOS DEPORTISTAS'!$Q$24:$Q$646,\"\")<30,\"\",(_xlfn.XLOOKUP(V24,'DATOS DEPORTISTAS'!$M$24:$M$646,'DATOS DEPORTISTAS'!$Q$24:$Q$646,\"\")))","v":""},null,null,null,null,null,null,null,null,null,null,null,null,null,null,null,null,null,null,null,null,{"$f":"_xlfn.XLOOKUP(V24,'DATOS DEPORTISTAS'!$M$24:$M$646,'DATOS DEPORTISTAS'!$J$24:$J$646,\"\")","v":0},null,null,null,null,null,null,null,{"$f":"_xlfn.XLOOKUP(V24,'DATOS DEPORTISTAS'!$M$24:$M$646,'DATOS DEPORTISTAS'!$U$24:$U$646,\"\")","v":0}]
["",null,null,null,null,null,null,null,null,null,null,null,null,null,null,null,{"$f":"IF(_xlfn.XLOOKUP(V25,'DATOS DEPORTISTAS'!$M$24:$M$646,'DATOS DEPORTISTAS'!$Q$24:$Q$646,\"\")<30,\"\",(_xlfn.XLOOKUP(V25,'DATOS DEPORTISTAS'!$M$24:$M$646,'DATOS DEPORTISTAS'!$Q$24:$Q$646,\"\")))","v":""},null,null,null,null,null,null,null,null,null,null,null,null,null,null,null,null,null,null,null,null,{"$f":"_xlfn.XLOOKUP(V25,'DATOS DEPORTISTAS'!$M$24:$M$646,'DATOS DEPORTISTAS'!$J$24:$J$646,\"\")","v":0},null,null,null,null,null,null,null,{"$f":"_xlfn.XLOOKUP(V25,'DATOS DEPORTISTAS'!$M$24:$M$646,'DATOS DEPORTISTAS'!$U$24:$U$646,\"\")","v":0}]
["",null,null,null,null,null,null,null,null,null,null,null,null,null,null,null,{"$f":"IF(_xlfn.XLOOKUP(V26,'DATOS DEPORTISTAS'!$M$24:$M$646,'DATOS DEPORTISTAS'!$Q$24:$Q$646,\"\")<30,\"\",(_xlfn.XLOOKUP(V26,'DATOS DEPORTISTAS'!$M$24:$M$646,'DATOS DEPORTISTAS'!$Q$24:$Q$646,\"\")))","v":""},null,null,null,null,null,null,null,null,null,null,null,null,null,null,null,null,null,null,null,null,{"$f":"_xlfn.XLOOKUP(V26,'DATOS DEPORTISTAS'!$M$24:$M$646,'DATOS DEPORTISTAS'!$J$24:$J$646,\"\")","v":0},null,null,null,null,null,null,null,{"$f":"_xlfn.XLOOKUP(V26,'DATOS DEPORTISTAS'!$M$24:$M$646,'DATOS DEPORTISTAS'!$U$24:$U$646,\"\")","v":0}]
["",null,null,null,null,null,null,null,null,null,null,null,null,null,null,null,{"$f":"IF(_xlfn.XLOOKUP(V27,'DATOS DEPORTISTAS'!$M$24:$M$646,'DATOS DEPORTISTAS'!$Q$24:$Q$646,\"\")<30,\"\",(_xlfn.XLOOKUP(V27,'DATOS DEPORTISTAS'!$M$24:$M$646,'DATOS DEPORTISTAS'!$Q$24:$Q$646,\"\")))","v":""},null,null,null,null,null,null,null,null,null,null,null,null,null,null,null,null,null,null,null,null,{"$f":"_xlfn.XLOOKUP(V27,'DATOS DEPORTISTAS'!$M$24:$M$646,'DATOS DEPORTISTAS'!$J$24:$J$646,\"\")","v":0},null,null,null,null,null,null,null,{"$f":"_xlfn.XLOOKUP(V27,'DATOS DEPORTISTAS'!$M$24:$M$646,'DATOS DEPORTISTAS'!$U$24:$U$646,\"\")","v":0}]
["",null,null,null,null,null,null,null,null,null,null,null,null,null,null,null,{"$f":"IF(_xlfn.XLOOKUP(V28,'DATOS DEPORTISTAS'!$M$24:$M$646,'DATOS DEPORTISTAS'!$Q$24:$Q$646,\"\")<30,\"\",(_xlfn.XLOOKUP(V28,'DATOS DEPORTISTAS'!$M$24:$M$646,'DATOS DEPORTISTAS'!$Q$24:$Q$646,\"\")))","v":""},null,null,null,null,null,null,null,null,null,null,null,null,null,null,null,null,null,null,null,null,{"$f":"_xlfn.XLOOKUP(V28,'DATOS DEPORTISTAS'!$M$24:$M$646,'DATOS DEPORTISTAS'!$J$24:$J$646,\"\")","v":0},null,null,null,null,null,null,null,{"$f":"_xlfn.XLOOKUP(V28,'DATOS DEPORTISTAS'!$M$24:$M$646,'DATOS DEPORTISTAS'!$U$24:$U$646,\"\")","v":0}]
["",null,null,null,null,null,null,null,null,null,null,null,null,null,null,null,{"$f":"IF(_xlfn.XLOOKUP(V29,'DATOS DEPORTISTAS'!$M$24:$M$646,'DATOS DEPORTISTAS'!$Q$24:$Q$646,\"\")<30,\"\",(_xlfn.XLOOKUP(V29,'DATOS DEPORTISTAS'!$M$24:$M$646,'DATOS DEPORTISTAS'!$Q$24:$Q$646,\"\")))","v":""},null,null,null,null,null,null,null,null,null,null,null,null,null,null,null,null,null,null,null,null,{"$f":"_xlfn.XLOOKUP(V29,'DATOS DEPORTISTAS'!$M$24:$M$646,'DATOS DEPORTISTAS'!$J$24:$J$646,\"\")","v":0},null,null,null,null,null,null,null,{"$f":"_xlfn.XLOOKUP(V29,'DATOS DEPORTISTAS'!$M$24:$M$646,'DATOS DEPORTISTAS'!$U$24:$U$646,\"\")","v":0}]
["",null,null,null,null,null,null,null,null,null,null,null,null,null,null,null,{"$f":"IF(_xlfn.XLOOKUP(V30,'DATOS DEPORTISTAS'!$M$24:$M$646,'DATOS DEPORTISTAS'!$Q$24:$Q$646,\"\")<30,\"\",(_xlfn.XLOOKUP(V30,'DATOS DEPORTISTAS'!$M$24:$M$646,'DATOS DEPORTISTAS'!$Q$24:$Q$646,\"\")))","v":""},null,null,null,null,null,null,null,null,null,null,null,null,null,null,null,null,null,null,null,null,{"$f":"_xlfn.XLOOKUP(V30,'DATOS DEPORTISTAS'!$M$24:$M$646,'DATOS DEPORTISTAS'!$J$24:$J$646,\"\")","v":0},null,null,null,null,null,null,null,{"$f":"_xlfn.XLOOKUP(V30,'DATOS DEPORTISTAS'!$M$24:$M$646,'DATOS DEPORTISTAS'!$U$24:$U$646,\"\")","v":0}]
["",null,null,null,null,null,null,null,null,null,null,null,null,null,null,null,{"$f":"IF(_xlfn.XLOOKUP(V31,'DATOS DEPORTISTAS'!$M$24:$M$646,'DATOS DEPORTISTAS'!$Q$24:$Q$646,\"\")<30,\"\",(_xlfn.XLOOKUP(V31,'DATOS DEPORTISTAS'!$M$24:$M$646,'DATOS DEPORTISTAS'!$Q$24:$Q$646,\"\")))","v":""},null,null,null,null,null,null,null,null,null,null,null,null,null,null,null,null,null,null,null,null,{"$f":"_xlfn.XLOOKUP(V31,'DATOS DEPORTISTAS'!$M$24:$M$646,'DATOS DEPORTISTAS'!$J$24:$J$646,\"\")","v":0},null,null,null,null,null,null,null,{"$f":"_xlfn.XLOOKUP(V31,'DATOS DEPORTISTAS'!$M$24:$M$646,'DATOS DEPORTISTAS'!$U$24:$U$646,\"\")","v":0}]
["",null,null,null,null,null,null,null,null,null,null,null,null,null,null,null,{"$f":"IF(_xlfn.XLOOKUP(V32,'DATOS DEPORTISTAS'!$M$24:$M$646,'DATOS DEPORTISTAS'!$Q$24:$Q$646,\"\")<30,\"\",(_xlfn.XLOOKUP(V32,'DATOS DEPORTISTAS'!$M$24:$M$646,'DATOS DEPORTISTAS'!$Q$24:$Q$646,\"\")))","v":""},null,null,null,null,null,null,null,null,null,null,null,null,null,null,null,null,null,null,null,null,{"$f":"_xlfn.XLOOKUP(V32,'DATOS DEPORTISTAS'!$M$24:$M$646,'DATOS DEPORTISTAS'!$J$24:$J$646,\"\")","v":0},null,null,null,null,null,null,null,{"$f":"_xlfn.XLOOKUP(V32,'DATOS DEPORTISTAS'!$M$24:$M$646,'DATOS DEPORTISTAS'!$U$24:$U$646,\"\")","v":0}]
["",null,null,null,null,null,null,null,null,null,null,null,null,null,null,null,{"$f":"IF(_xlfn.XLOOKUP(V33,'DATOS DEPORTISTAS'!$M$24:$M$646,'DATOS DEPORTISTAS'!$Q$24:$Q$646,\"\")<30,\"\",(_xlfn.XLOOKUP(V33,'DATOS DEPORTISTAS'!$M$24:$M$646,'DATOS DEPORTISTAS'!$Q$24:$Q$646,\"\")))","v":""},null,null,null,null,null,null,null,null,null,null,null,null,null,null,null,null,null,null,null,null,{"$f":"_xlfn.XLOOKUP(V33,'DATOS DEPORTISTAS'!$M$24:$M$646,'DATOS DEPORTISTAS'!$J$24:$J$646,\"\")","v":0},null,null,null,null,null,null,null,{"$f":"_xlfn.XLOOKUP(V33,'DATOS DEPORTISTAS'!$M$24:$M$646,'DATOS DEPORTISTAS'!$U$24:$U$646,\"\")","v":0}]
["",null,null,null,null,null,null,null,null,null,null,null,null,null,null,null,{"$f":"IF(_xlfn.XLOOKUP(V34,'DATOS DEPORTISTAS'!$M$24:$M$646,'DATOS DEPORTISTAS'!$Q$24:$Q$646,\"\")<30,\"\",(_xlfn.XLOOKUP(V34,'DATOS DEPORTISTAS'!$M$24:$M$646,'DATOS DEPORTISTAS'!$Q$24:$Q$646,\"\")))","v":""},null,null,null,null,null,null,null,null,null,null,null,null,null,null,null,null,null,null,null,null,{"$f":"_xlfn.XLOOKUP(V34,'DATOS DEPORTISTAS'!$M$24:$M$646,'DATOS DEPORTISTAS'!$J$24:$J$646,\"\")","v":0},null,null,null,null,null,null,null,{"$f":"_xlfn.XLOOKUP(V34,'DATOS DEPORTISTAS'!$M$24:$M$646,'DATOS DEPORTISTAS'!$U$24:$U$646,\"\")","v":0}]
["",null,null,null,null,null,null,null,null,null,null,null,null,null,null,null,{"$f":"IF(_xlfn.XLOOKUP(V35,'DATOS DEPORTISTAS'!$M$24:$M$646,'DATOS DEPORTISTAS'!$Q$24:$Q$646,\"\")<30,\"\",(_xlfn.XLOOKUP(V35,'DATOS DEPORTISTAS'!$M$24:$M$646,'DATOS DEPORTISTAS'!$Q$24:$Q$646,\"\")))","v":""},null,null,null,null,null,null,null,null,null,null,null,null,null,null,null,null,null,null,null,null,{"$f":"_xlfn.XLOOKUP(V35,'DATOS DEPORTISTAS'!$M$24:$M$646,'DATOS DEPORTISTAS'!$J$24:$J$646,\"\")","v":0},null,null,null,null,null,null,null,{"$f":"_xlfn.XLOOKUP(V35,'DATOS DEPORTISTAS'!$M$24:$M$646,'DATOS DEPORTISTAS'!$U$24:$U$646,\"\")","v":0}]
["",null,null,null,null,null,null,null,null,null,null,null,null,null,null,null,{"$f":"IF(_xlfn.XLOOKUP(V36,'DATOS DEPORTISTAS'!$M$24:$M$646,'DATOS DEPORTISTAS'!$Q$24:$Q$646,\"\")<30,\"\",(_xlfn.XLOOKUP(V36,'DATOS DEPORTISTAS'!$M$24:$M$646,'DATOS DEPORTISTAS'!$Q$24:$Q$646,\"\")))","v":""},null,null,null,null,null,null,null,null,null,null,null,null,null,null,null,null,null,null,null,null,{"$f":"_xlfn.XLOOKUP(V36,'DATOS DEPORTISTAS'!$M$24:$M$646,'DATOS DEPORTISTAS'!$J$24:$J$646,\"\")","v":0},null,null,null,null,null,null,null,{"$f":"_xlfn.XLOOKUP(V36,'DATOS DEPORTISTAS'!$M$24:$M$646,'DATOS DEPORTISTAS'!$U$24:$U$646,\"\")","v":0}]
["",null,null,null,null,null,null,null,null,null,null,null,null,null,null,null,{"$f":"IF(_xlfn.XLOOKUP(V37,'DATOS DEPORTISTAS'!$M$24:$M$646,'DATOS DEPORTISTAS'!$Q$24:$Q$646,\"\")<30,\"\",(_xlfn.XLOOKUP(V37,'DATOS DEPORTISTAS'!$M$24:$M$646,'DATOS DEPORTISTAS'!$Q$24:$Q$646,\"\")))","v":""},null,null,null,null,null,null,null,null,null,null,null,null,null,null,null,null,null,null,null,null,{"$f":"_xlfn.XLOOKUP(V37,'DATOS DEPORTISTAS'!$M$24:$M$646,'DATOS DEPORTISTAS'!$J$24:$J$646,\"\")","v":0},null,null,null,null,null,null,null,{"$f":"_xlfn.XLOOKUP(V37,'DATOS DEPORTISTAS'!$M$24:$M$646,'DATOS DEPORTISTAS'!$U$24:$U$646,\"\")","v":0}]
["",null,null,null,null,null,null,null,null,null,null,null,null,null,null,null,{"$f":"IF(_xlfn.XLOOKUP(V38,'DATOS DEPORTISTAS'!$M$24:$M$646,'DATOS DEPORTISTAS'!$Q$24:$Q$646,\"\")<30,\"\",(_xlfn.XLOOKUP(V38,'DATOS DEPORTISTAS'!$M$24:$M$646,'DATOS DEPORTISTAS'!$Q$24:$Q$646,\"\")))","v":""},null,null,null,null,null,null,null,null,null,null,null,null,null,null,null,null,null,null,null,null,{"$f":"_xlfn.XLOOKUP(V38,'DATOS DEPORTISTAS'!$M$24:$M$646,'DATOS DEPORTISTAS'!$J$24:$J$646,\"\")","v":0},null,null,null,null,null,null,null,{"$f":"_xlfn.XLOOKUP(V38,'DATOS DEPORTISTAS'!$M$24:$M$646,'DATOS DEPORTISTAS'!$U$24:$U$646,\"\")","v":0}]
[]
[]
[null,"Entrenador: D. ",null,null,null,null,null,null,null,null,null,null,null,null,null,null,null,null,null,null,null,null,null,null,null,null,null,null,null,null,null,null,"Nº FICHA:",null,null,null,null,{"$f":"_xlfn.XLOOKUP(H41,'DATOS DEPORTISTAS'!$M$24:$M$646,'DATOS DEPORTISTAS'!$U$24:$U$646,\"\")","v":0}]
[]
[null,"Categoría:"]
[]
[null,"Delegado: D.",null,null,null,null,null,null,null,null,null,null,null,null,null,null,null,null,null,null,null,null,null,null,null,null,null,null,null,null,null,null,"Nº FICHA:",null,null,null,null,{"$f":"_xlfn.XLOOKUP(H45,'DATOS DEPORTISTAS'!$M$24:$M$646,'DATOS DEPORTISTAS'!$U$24:$U$646,\"\")","v":0}]
[]
[]
[null,null,null,null,null,null,null,null,null,null,null,null,null,null,null,null,null,null,"En,",null,null,null,null,null,null,null,null,null,null,null,null,",a",null,null,"de",null,null,null,null,null,null,null,null,null,null,null,"de"]
[]
[null,null,null,null,null,null,null,null,null,null,null,null,null,null,null,null,null,null,null,null,null,null,null,null,null,null,null,null,null,null,"WEB:",null," www.farremo.es",null,null,null,null,null,null,null,"email: ",null,null,"farremo@farremo.es"]

{"sheet":"INSCRIPCIONES MIXTO","index":3,"n_rows":50,"n_cols":47,"rows_kept":50,"cut":false,"hidden":true,"merged":[[5,9,5,12],[5,18,5,22],[47,20,47,30],[47,32,47,33],[47,34,47,35],[47,36,47,45],[47,47,47,49],[37,45,37,50],[37,53,37,63],[40,7,40,30],[40,37,40,49],[42,7,42,33],[44,7,44,30],[44,37,44,49],[37,0,37,8],[37,9,37,15],[37,16,37,18],[37,19,37,20],[37,21,37,36],[37,37,37,44],[35,45,35,50],[35,53,35,63],[36,0,36,8],[36,9,36,15],[36,16,36,18],[36,19,36,20],[36,21,36,36],[36,37,36,44],[36,45,36,50],[36,53,36,63],[35,0,35,8],[35,9,35,15],[35,16,35,18],[35,19,35,20],[35,21,35,36],[35,37,35,44],[33,45,33,50],[33,53,33,63],[34,0,34,8],[34,9,34,15],[34,16,34,18],[34,19,34,20],[34,21,34,36],[34,37,34,44],[34,45,34,50],[34,53,34,63],[33,0,33,8],[33,9,33,15],[33,16,33,18],[33,19,33,20],[33,21,33,36],[33,37,33,44],[31,45,31,50],[31,53,31,63],[32,0,32,8],[32,9,32,15],[32,16,32,18],[32,19,32,20],[32,21,32,36],[32,37,32,44],[32,45,32,50],[32,53,32,63],[31,0,31,8],[31,9,31,15],[31,16,31,18],[31,19,31,20],[31,21,31,36],[31,37,31,44],[29,45,29,50],[29,53,29,63],[30,0,30,8],[30,9,30,15],[30,16,30,18],[30,19,30,20],[30,21,30,36],[30,37,30,44],[30,45,30,50],[30,53,30,63],[29,0,29,8],[29,9,29,15],[29,16,29,18],[29,19,29,20],[29,21,29,36],[29,37,29,44],[27,45,27,50],[27,53,27,63],[28,0,28,8],[28,9,28,15],[28,16,28,18],[28,19,28,20],[28,21,28,36],[28,37,28,44],[28,45,28,50],[28,53,28,63],[27,0,27,8],[27,9,27,15],[27,16,27,18],[27,19,27,20],[27,21,27,36],[27,37,27,44],[25,45,25,50],[25,53,25,63],[26,0,26,8],[26,9,26,15],[26,16,26,18],[26,19,26,20],[26,21,26,36],[26,37,26,44],[26,45,26,50],[26,53,26,63],[25,0,25,8],[25,9,25,15],[25,16,25,18],[25,19,25,20],[25,21,25,36],[25,37,25,44],[23,45,23,50],[23,53,23,63],[24,0,24,8],[24,9,24,15],[24,16,24,18],[24,19,24,20],[24,21,24,36],[24,37,24,44],[24,45,24,50],[24,53,24,63],[23,0,23,8],[23,9,23,15],[23,16,23,18],[23,19,23,20],[23,21,23,36],[23,37,23,44],[21,53,21,63],[22,0,22,8],[22,9,22,15],[22,16,22,18],[22,19,22,20],[22,21,22,36],[22,37,22,44],[22,45,22,50],[22,53,22,63],[7,23,7,49],[9,9,9,49],[11,15,11,49],[13,12,13,27],[13,37,13,49],[17,11,17,26],[17,33,17,49],[20,45,20,50],[21,0,21,8],[21,9,21,15],[21,16,21,18],[21,19,21,20],[21,21,21,36],[21,37,21,44],[21,45,21,50],[20,0,20,8],[20,9,20,15],[20,16,20,18],[20,19,20,20],[20,21,20,36],[20,37,20,44]]}
[]
[null,null,null,null,null,null,null,null,null,null,null,null,null,null,null,null,null,null,null,null,null,null,null,null,"FEDERACIÓN ARAGONESA DE REMO"]
[null,null,null,null,null,null,null,null,null,null,null,null,null,null,"Hoja de inscripción oficial"]
[]
[]
[null,null,null,"Nº DE HOJA",null,null,null,null,null,1,null,null,null,null,null,"DE",null,null,1]
[]
[null,"Hoja de Inscripción que formula el Club:"]
[]
[null,"Adscrito a la,",null,null,null,null,null,null,null,"FEDERACIÓN ARAGONESA DE REMO"]
[]
[null,"para PARTICIPAR en, "]
[]
[null,"que se celebrará en ",null,null,null,null,null,null,null,null,null,null,null,null,null,null,null,null,null,null,null,null,null,null,null,null,null,null,null,"durante los dias"]
[]
[null,"INSCRIBE a los equipos más abajo indicados"]
[]
[null,"Colores: Uniforme:"]
[]
[]
["CATEGORIA",null,null,null,null,null,null,null,null,"Modalidad",null,null,null,null,null,null,"Edad",null,null,"Pto",null,"NOMBRE, APELLIDOS",null,null,null,null,null,null,null,null,null,null,null,null,null,null,null,"SEXO",null,null,null,null,null,null,null,"Nº FICHA."]
[{"$f":"IF(BB22=\"BENJAMIN\",\"BENJAMIN\",IF(BB22=\"ALEVIN\",\"ALEVIN\",IF(BB22=\"INFANTIL\",\"INFANTIL\",IF(BB22=\"CADETE\",\"CADETE\",IF(BB22=\"JUVENIL\",\"JUVENIL\",IF(BB22=\"SENIOR\",\"SENIOR\",IF(BB22=\"VETERANO\",\"VETERANO\",IF(BB22=\"BENJAMIN_NZ\",\"BENJAMIN\",IF(BB22=\"ALEVIN_NZ\",\"ALEVIN\",IF(BB22=\"INFANTIL_NZ\",\"INFANTIL\",IF(BB22=\"CADETE_NZ\",\"CADETE\",IF(BB22=\"JUVENIL_NZ\",\"JUVENIL\",IF(BB22=\"SENIOR_NZ\",\"SENIOR\",IF(BB22=\"VETERANO_NZ\",\"VETERANO\",IF(BB22=\"ALEVIN_NB\",\"ALEVIN\",IF(BB22=\"INFANTIL_NB\",\"INFANTIL\",IF(BB22=\"CADETE_NB\",\"CADETE\",IF(BB22=\"JUVENIL_NB\",\"JUVENIL\",IF(BB22=\"SENIOR_NB\",\"SENIOR\",IF(BB22=\"VETERANO_NB\",\"VETERANO\",IF(BB22=\"BENJAMIN_CM\",\"BENJAMIN\",IF(BB22=\"ALEVIN_CM\",\"ALEVIN\",IF(BB22=\"INFANTIL_CM\",\"INFANTIL\",IF(BB22=\"CADETE_CM\",\"CADETE\",IF(BB22=\"JUVENIL_CM\",\"JUVENIL\",IF(BB22=\"SENIOR_CM\",\"SENIOR\",IF(BB22=\"VETERANO_CM\",\"VETERANO\",IF(BB22=\"BENJAMIN_AR\",\"BENJAMIN\",IF(BB22=\"ALEVIN_AR\",\"ALEVIN\",IF(BB22=\"INFANTIL_AR\",\"INFANTIL\",IF(BB22=\"CADETE_AR\",\"CADETE\",IF(BB22=\"JUVENIL_AR\",\"JUVENIL\",IF(BB22=\"SENIOR_AR\",\"SENIOR\",IF(BB22=\"VETERANO_AR\",\"VETERANO\",IF(BB22=\"BENJAMIN_RZ\",\"BENJAMIN\",IF(BB22=\"ALEVIN_RZ\",\"ALEVIN\",IF(BB22=\"INFANTIL_RZ\",\"INFANTIL\",IF(BB22=\"CADETE_RZ\",\"CADETE\",IF(BB22=\"JUVENIL_RZ\",\"JUVENIL\",IF(BB22=\"SENIOR_RZ\",\"SENIOR\",IF(BB22=\"VETERANO_RZ\",\"VETERANO\",\"\")))))))))))))))))))))))))))))))))))))))))","v":""},null,null,null,null,null,null,null,null,null,null,null,null,null,null,null,{"$f":"IF(_xlfn.XLOOKUP(V22,'DATOS DEPORTISTAS'!$M$24:$M$646,'DATOS DEPORTISTAS'!$Q$24:$Q$646,\"\")<30,\"\",(_xlfn.XLOOKUP(V22,'DATOS DEPORTISTAS'!$M$24:$M$646,'DATOS DEPORTISTAS'!$Q$24:$Q$646,\"\")))","v":""},null,null,null,null,null,null,null,null,null,null,null,null,null,null,null,null,null,null,null,null,{"$f":"_xlfn.XLOOKUP(V22,'DATOS DEPORTISTAS'!$M$24:$M$646,'DATOS DEPORTISTAS'!$J$24:$J$646,\"\")","v":0},null,null,null,null,null,null,null,{"$f":"_xlfn.XLOOKUP(V22,'DATOS DEPORTISTAS'!$M$24:$M$646,'DATOS DEPORTISTAS'!$U$24:$U$646,\"\")","v":0}]
[{"$f":"IF(BB23=\"BENJAMIN\",\"BENJAMIN\",IF(BB23=\"ALEVIN\",\"ALEVIN\",IF(BB23=\"INFANTIL\",\"INFANTIL\",IF(BB23=\"CADETE\",\"CADETE\",IF(BB23=\"JUVENIL\",\"JUVENIL\",IF(BB23=\"SENIOR\",\"SENIOR\",IF(BB23=\"VETERANO\",\"VETERANO\",IF(BB23=\"BENJAMIN_NZ\",\"BENJAMIN\",IF(BB23=\"ALEVIN_NZ\",\"ALEVIN\",IF(BB23=\"INFANTIL_NZ\",\"INFANTIL\",IF(BB23=\"CADETE_NZ\",\"CADETE\",IF(BB23=\"JUVENIL_NZ\",\"JUVENIL\",IF(BB23=\"SENIOR_NZ\",\"SENIOR\",IF(BB23=\"VETERANO_NZ\",\"VETERANO\",IF(BB23=\"ALEVIN_NB\",\"ALEVIN\",IF(BB23=\"INFANTIL_NB\",\"INFANTIL\",IF(BB23=\"CADETE_NB\",\"CADETE\",IF(BB23=\"JUVENIL_NB\",\"JUVENIL\",IF(BB23=\"SENIOR_NB\",\"SENIOR\",IF(BB23=\"VETERANO_NB\",\"VETERANO\",IF(BB23=\"BENJAMIN_CM\",\"BENJAMIN\",IF(BB23=\"ALEVIN_CM\",\"ALEVIN\",IF(BB23=\"INFANTIL_CM\",\"INFANTIL\",IF(BB23=\"CADETE_CM\",\"CADETE\",IF(BB23=\"JUVENIL_CM\",\"JUVENIL\",IF(BB23=\"SENIOR_CM\",\"SENIOR\",IF(BB23=\"VETERANO_CM\",\"VETERANO\",IF(BB23=\"BENJAMIN_AR\",\"BENJAMIN\",IF(BB23=\"ALEVIN_AR\",\"ALEVIN\",IF(BB23=\"INFANTIL_AR\",\"INFANTIL\",IF(BB23=\"CADETE_AR\",\"CADETE\",IF(BB23=\"JUVENIL_AR\",\"JUVENIL\",IF(BB23=\"SENIOR_AR\",\"SENIOR\",IF(BB23=\"VETERANO_AR\",\"VETERANO\",IF(BB23=\"BENJAMIN_RZ\",\"BENJAMIN\",IF(BB23=\"ALEVIN_RZ\",\"ALEVIN\",IF(BB23=\"INFANTIL_RZ\",\"INFANTIL\",IF(BB23=\"CADETE_RZ\",\"CADETE\",IF(BB23=\"JUVENIL_RZ\",\"JUVENIL\",IF(BB23=\"SENIOR_RZ\",\"SENIOR\",IF(BB23=\"VETERANO_RZ\",\"VETERANO\",\"\")))))))))))))))))))))))))))))))))))))))))","v":""},null,null,null,null,null,null,null,null,null,null,null,null,null,null,null,{"$f":"IF(_xlfn.XLOOKUP(V23,'DATOS DEPORTISTAS'!$M$24:$M$646,'DATOS DEPORTISTAS'!$Q$24:$Q$646,\"\")<30,\"\",(_xlfn.XLOOKUP(V23,'DATOS DEPORTISTAS'!$M$24:$M$646,'DATOS DEPORTISTAS'!$Q$24:$Q$646,\"\")))","v":""},null,null,null,null,null,null,null,null,null,null,null,null,null,null,null,null,null,null,null,null,{"$f":"_xlfn.XLOOKUP(V23,'DATOS DEPORTISTAS'!$M$24:$M$646,'DATOS DEPORTISTAS'!$J$24:$J$646,\"\")","v":0},null,null,null,null,null,null,null,{"$f":"_xlfn.XLOOKUP(V23,'DATOS DEPORTISTAS'!$M$24:$M$646,'DATOS DEPORTISTAS'!$U$24:$U$646,\"\")","v":0}]
["",null,null,null,null,null,null,null,null,null,null,null,null,null,null,null,{"$f":"IF(_xlfn.XLOOKUP(V24,'DATOS DEPORTISTAS'!$M$24:$M$646,'DATOS DEPORTISTAS'!$Q$24:$Q$646,\"\")<30,\"\",(_xlfn.XLOOKUP(V24,'DATOS DEPORTISTAS'!$M$24:$M$646,'DATOS DEPORTISTAS'!$Q$24:$Q$646,\"\")))","v":""},null,null,null,null,null,null,null,null,null,null,null,null,null,null,null,null,null,null,null,null,{"$f":"_xlfn.XLOOKUP(V24,'DATOS DEPORTISTAS'!$M$24:$M$646,'DATOS DEPORTISTAS'!$J$24:$J$646,\"\")","v":0},null,null,null,null,null,null,null,{"$f":"_xlfn.XLOOKUP(V24,'DATOS DEPORTISTAS'!$M$24:$M$646,'DATOS DEPORTISTAS'!$U$24:$U$646,\"\")","v":0}]
["",null,null,null,null,null,null,null,null,null,null,null,null,null,null,null,{"$f":"IF(_xlfn.XLOOKUP(V25,'DATOS DEPORTISTAS'!$M$24:$M$646,'DATOS DEPORTISTAS'!$Q$24:$Q$646,\"\")<30,\"\",(_xlfn.XLOOKUP(V25,'DATOS DEPORTISTAS'!$M$24:$M$646,'DATOS DEPORTISTAS'!$Q$24:$Q$646,\"\")))","v":""},null,null,null,null,null,null,null,null,null,null,null,null,null,null,null,null,null,null,null,null,{"$f":"_xlfn.XLOOKUP(V25,'DATOS DEPORTISTAS'!$M$24:$M$646,'DATOS DEPORTISTAS'!$J$24:$J$646,\"\")","v":0},null,null,null,null,null,null,null,{"$f":"_xlfn.XLOOKUP(V25,'DATOS DEPORTISTAS'!$M$24:$M$646,'DATOS DEPORTISTAS'!$U$24:$U$646,\"\")","v":0}]
["",null,null,null,null,null,null,null,null,null,null,null,null,null,null,null,{"$f":"IF(_xlfn.XLOOKUP(V26,'DATOS DEPORTISTAS'!$M$24:$M$646,'DATOS DEPORTISTAS'!$Q$24:$Q$646,\"\")<30,\"\",(_xlfn.XLOOKUP(V26,'DATOS DEPORTISTAS'!$M$24:$M$646,'DATOS DEPORTISTAS'!$Q$24:$Q$646,\"\")))","v":""},null,null,null,null,null,null,null,null,null,null,null,null,null,null,null,null,null,null,null,null,{"$f":"_xlfn.XLOOKUP(V26,'DATOS DEPORTISTAS'!$M$24:$M$646,'DATOS DEPORTISTAS'!$J$24:$J$646,\"\")","v":0},null,null,null,null,null,null,null,{"$f":"_xlfn.XLOOKUP(V26,'DATOS DEPORTISTAS'!$M$24:$M$646,'DATOS DEPORTISTAS'!$U$24:$U$646,\"\")","v":0}]
["",null,null,null,null,null,null,null,null,null,null,null,null,null,null,null,{"$f":"IF(_xlfn.XLOOKUP(V27,'DATOS DEPORTISTAS'!$M$24:$M$646,'DATOS DEPORTISTAS'!$Q$24:$Q$646,\"\")<30,\"\",(_xlfn.XLOOKUP(V27,'DATOS DEPORTISTAS'!$M$24:$M$646,'DATOS DEPORTISTAS'!$Q$24:$Q$646,\"\")))","v":""},null,null,null,null,null,null,null,null,null,null,null,null,null,null,null,null,null,null,null,null,{"$f":"_xlfn.XLOOKUP(V27,'DATOS DEPORTISTAS'!$M$24:$M$646,'DATOS DEPORTISTAS'!$J$24:$J$646,\"\")","v":0},null,null,null,null,null,null,null,{"$f":"_xlfn.XLOOKUP(V27,'DATOS DEPORTISTAS'!$M$24:$M$646,'DATOS DEPORTISTAS'!$U$24:$U$646,\"\")","v":0}]
["",null,null,null,null,null,null,null,null,null,null,null,null,null,null,null,{"$f":"IF(_xlfn.XLOOKUP(V28,'DATOS DEPORTISTAS'!$M$24:$M$646,'DATOS DEPORTISTAS'!$Q$24:$Q$646,\"\")<30,\"\",(_xlfn.XLOOKUP(V28,'DATOS DEPORTISTAS'!$M$24:$M$646,'DATOS DEPORTISTAS'!$Q$24:$Q$646,\"\")))","v":""},null,null,null,null,null,null,null,null,null,null,null,null,null,null,null,null,null,null,null,null,{"$f":"_xlfn.XLOOKUP(V28,'DATOS DEPORTISTAS'!$M$24:$M$646,'DATOS DEPORTISTAS'!$J$24:$J$646,\"\")","v":0},null,null,null,null,null,null,null,{"$f":"_xlfn.XLOOKUP(V28,'DATOS DEPORTISTAS'!$M$24:$M$646,'DATOS DEPORTISTAS'!$U$24:$U$646,\"\")","v":0}]
["",null,null,null,null,null,null,null,null,null,null,null,null,null,null,null,{"$f":"IF(_xlfn.XLOOKUP(V29,'DATOS DEPORTISTAS'!$M$24:$M$646,'DATOS DEPORTISTAS'!$Q$24:$Q$646,\"\")<30,\"\",(_xlfn.XLOOKUP(V29,'DATOS DEPORTISTAS'!$M$24:$M$646,'DATOS DEPORTISTAS'!$Q$24:$Q$646,\"\")))","v":""},null,null,null,null,null,null,null,null,null,null,null,null,null,null,null,null,null,null,null,null,{"$f":"_xlfn.XLOOKUP(V29,'DATOS DEPORTISTAS'!$M$24:$M$646,'DATOS DEPORTISTAS'!$J$24:$J$646,\"\")","v":0},null,null,null,null,null,null,null,{"$f":"_xlfn.XLOOKUP(V29,'DATOS DEPORTISTAS'!$M$24:$M$646,'DATOS DEPORTISTAS'!$U$24:$U$646,\"\")","v":0}]
["",null,null,null,null,null,null,null,null,null,null,null,null,null,null,null,{"$f":"IF(_xlfn.XLOOKUP(V30,'DATOS DEPORTISTAS'!$M$24:$M$646,'DATOS DEPORTISTAS'!$Q$24:$Q$646,\"\")<30,\"\",(_xlfn.XLOOKUP(V30,'DATOS DEPORTISTAS'!$M$24:$M$646,'DATOS DEPORTISTAS'!$Q$24:$Q$646,\"\")))","v":""},null,null,null,null,null,null,null,null,null,null,null,null,null,null,null,null,null,null,null,null,{"$f":"_xlfn.XLOOKUP(V30,'DATOS DEPORTISTAS'!$M$24:$M$646,'DATOS DEPORTISTAS'!$J$24:$J$646,\"\")","v":0},null,null,null,null,null,null,null,{"$f":"_xlfn.XLOOKUP(V30,'DATOS DEPORTISTAS'!$M$24:$M$646,'DATOS DEPORTISTAS'!$U$24:$U$646,\"\")","v":0}]
["",null,null,null,null,null,null,null,null,null,null,null,null,null,null,null,{"$f":"IF(_xlfn.XLOOKUP(V31,'DATOS DEPORTISTAS'!$M$24:$M$646,'DATOS DEPORTISTAS'!$Q$24:$Q$646,\"\")<30,\"\",(_xlfn.XLOOKUP(V31,'DATOS DEPORTISTAS'!$M$24:$M$646,'DATOS DEPORTISTAS'!$Q$24:$Q$646,\"\")))","v":""},null,null,null,null,null,null,null,null,null,null,null,null,null,null,null,null,null,null,null,null,{"$f":"_xlfn.XLOOKUP(V31,'DATOS DEPORTISTAS'!$M$24:$M$646,'DATOS DEPORTISTAS'!$J$24:$J$646,\"\")","v":0},null,null,null,null,null,null,null,{"$f":"_xlfn.XLOOKUP(V31,'DATOS DEPORTISTAS'!$M$24:$M$646,'DATOS DEPORTISTAS'!$U$24:$U$646,\"\")","v":0}]
["",null,null,null,null,null,null,null,null,null,null,null,null,null,null,null,{"$f":"IF(_xlfn.XLOOKUP(V32,'DATOS DEPORTISTAS'!$M$24:$M$646,'DATOS DEPORTISTAS'!$Q$24:$Q$646,\"\")<30,\"\",(_xlfn.XLOOKUP(V32,'DATOS DEPORTISTAS'!$M$24:$M$646,'DATOS DEPORTISTAS'!$Q$24:$Q$646,\"\")))","v":""},null,null,null,null,null,null,null,null,null,null,null,null,null,null,null,null,null,null,null,null,{"$f":"_xlfn.XLOOKUP(V32,'DATOS DEPORTISTAS'!$M$24:$M$646,'DATOS DEPORTISTAS'!$J$24:$J$646,\"\")","v":0},null,null,null,null,null,null,null,{"$f":"_xlfn.XLOOKUP(V32,'DATOS DEPORTISTAS'!$M$24:$M$646,'DATOS DEPORTISTAS'!$U$24:$U$646,\"\")","v":0}]
["",null,null,null,null,null,null,null,null,null,null,null,null,null,null,null,{"$f":"IF(_xlfn.XLOOKUP(V33,'DATOS DEPORTISTAS'!$M$24:$M$646,'DATOS DEPORTISTAS'!$Q$24:$Q$646,\"\")<30,\"\",(_xlfn.XLOOKUP(V33,'DATOS DEPORTISTAS'!$M$24:$M$646,'DATOS DEPORTISTAS'!$Q$24:$Q$646,\"\")))","v":""},null,null,null,null,null,null,null,null,null,null,null,null,null,null,null,null,null,null,null,null,{"$f":"_xlfn.XLOOKUP(V33,'DATOS DEPORTISTAS'!$M$24:$M$646,'DATOS DEPORTISTAS'!$J$24:$J$646,\"\")","v":0},null,null,null,null,null,null,null,{"$f":"_xlfn.XLOOKUP(V33,'DATOS DEPORTISTAS'!$M$24:$M$646,'DATOS DEPORTISTAS'!$U$24:$U$646,\"\")","v":0}]
["",null,null,null,null,null,null,null,null,null,null,null,null,null,null,null,{"$f":"IF(_xlfn.XLOOKUP(V34,'DATOS DEPORTISTAS'!$M$24:$M$646,'DATOS DEPORTISTAS'!$Q$24:$Q$646,\"\")<30,\"\",(_xlfn.XLOOKUP(V34,'DATOS DEPORTISTAS'!$M$24:$M$646,'DATOS DEPORTISTAS'!$Q$24:$Q$646,\"\")))","v":""},null,null,null,null,null,null,null,null,null,null,null,null,null,null,null,null,null,null,null,null,{"$f":"_xlfn.XLOOKUP(V34,'DATOS DEPORTISTAS'!$M$24:$M$646,'DATOS DEPORTISTAS'!$J$24:$J$646,\"\")","v":0},null,null,null,null,null,null,null,{"$f":"_xlfn.XLOOKUP(V34,'DATOS DEPORTISTAS'!$M$24:$M$646,'DATOS DEPORTISTAS'!$U$24:$U$646,\"\")","v":0}]
["",null,null,null,null,null,null,null,null,null,null,null,null,null,null,null,{"$f":"IF(_xlfn.XLOOKUP(V35,'DATOS DEPORTISTAS'!$M$24:$M$646,'DATOS DEPORTISTAS'!$Q$24:$Q$646,\"\")<30,\"\",(_xlfn.XLOOKUP(V35,'DATOS DEPORTISTAS'!$M$24:$M$646,'DATOS DEPORTISTAS'!$Q$24:$Q$646,\"\")))","v":""},null,null,null,null,null,null,null,null,null,null,null,null,null,null,null,null,null,null,null,null,{"$f":"_xlfn.XLOOKUP(V35,'DATOS DEPORTISTAS'!$M$24:$M$646,'DATOS DEPORTISTAS'!$J$24:$J$646,\"\")","v":0},null,null,null,null,null,null,null,{"$f":"_xlfn.XLOOKUP(V35,'DATOS DEPORTISTAS'!$M$24:$M$646,'DATOS DEPORTISTAS'!$U$24:$U$646,\"\")","v":0}]
["",null,null,null,null,null,null,null,null,null,null,null,null,null,null,null,{"$f":"IF(_xlfn.XLOOKUP(V36,'DATOS DEPORTISTAS'!$M$24:$M$646,'DATOS DEPORTISTAS'!$Q$24:$Q$646,\"\")<30,\"\",(_xlfn.XLOOKUP(V36,'DATOS DEPORTISTAS'!$M$24:$M$646,'DATOS DEPORTISTAS'!$Q$24:$Q$646,\"\")))","v":""},null,null,null,null,null,null,null,null,null,null,null,null,null,null,null,null,null,null,null,null,{"$f":"_xlfn.XLOOKUP(V36,'DATOS DEPORTISTAS'!$M$24:$M$646,'DATOS DEPORTISTAS'!$J$24:$J$646,\"\")","v":0},null,null,null,null,null,null,null,{"$f":"_xlfn.XLOOKUP(V36,'DATOS DEPORTISTAS'!$M$24:$M$646,'DATOS DEPORTISTAS'!$U$24:$U$646,\"\")","v":0}]
["",null,null,null,null,null,null,null,null,null,null,null,null,null,null,null,{"$f":"IF(_xlfn.XLOOKUP(V37,'DATOS DEPORTISTAS'!$M$24:$M$646,'DATOS DEPORTISTAS'!$Q$24:$Q$646,\"\")<30,\"\",(_xlfn.XLOOKUP(V37,'DATOS DEPORTISTAS'!$M$24:$M$646,'DATOS DEPORTISTAS'!$Q$24:$Q$646,\"\")))","v":""},null,null,null,null,null,null,null,null,null,null,null,null,null,null,null,null,null,null,null,null,{"$f":"_xlfn.XLOOKUP(V37,'DATOS DEPORTISTAS'!$M$24:$M$646,'DATOS DEPORTISTAS'!$J$24:$J$646,\"\")","v":0},null,null,null,null,null,null,null,{"$f":"_xlfn.XLOOKUP(V37,'DATOS DEPORTISTAS'!$M$24:$M$646,'DATOS DEPORTISTAS'!$U$24:$U$646,\"\")","v":0}]
["",null,null,null,null,null,null,null,null,null,null,null,null,null,null,null,{"$f":"IF(_xlfn.XLOOKUP(V38,'DATOS DEPORTISTAS'!$M$24:$M$646,'DATOS DEPORTISTAS'!$Q$24:$Q$646,\"\")<30,\"\",(_xlfn.XLOOKUP(V38,'DATOS DEPORTISTAS'!$M$24:$M$646,'DATOS DEPORTISTAS'!$Q$24:$Q$646,\"\")))","v":""},null,null,null,null,null,null,null,null,null,null,null,null,null,null,null,null,null,null,null,null,{"$f":"_xlfn.XLOOKUP(V38,'DATOS DEPORTISTAS'!$M$24:$M$646,'DATOS DEPORTISTAS'!$J$24:$J$646,\"\")","v":0},null,null,null,null,null,null,null,{"$f":"_xlfn.XLOOKUP(V38,'DATOS DEPORTISTAS'!$M$24:$M$646,'DATOS DEPORTISTAS'!$U$24:$U$646,\"\")","v":0}]
[]
[]
[null,"Entrenador: D. ",null,null,null,null,null,null,null,null,null,null,null,null,null,null,null,null,null,null,null,null,null,null,null,null,null,null,null,null,null,null,"Nº FICHA:",null,null,null,null,{"$f":"_xlfn.XLOOKUP(H41,'DATOS DEPORTISTAS'!$M$24:$M$646,'DATOS DEPORTISTAS'!$U$24:$U$646,\"\")","v":0}]
[]
[null,"Categoría:"]
[]
[null,"Delegado: D.",null,null,null,null,null,null,null,null,null,null,null,null,null,null,null,null,null,null,null,null,null,null,null,null,null,null,null,null,null,null,"Nº FICHA:",null,null,null,null,{"$f":"_xlfn.XLOOKUP(H45,'DATOS DEPORTISTAS'!$M$24:$M$646,'DATOS DEPORTISTAS'!$U$24:$U$646,\"\")","v":0}]
[]
[]
[null,null,null,null,null,"Firma delegado",null,null,null,null,null,null,null,null,null,null,null,"En, ",null,null,null,null,null,null,null,null,null,null,null,null,null,",a ",null,null,"de",null,null,null,null,null,null,null,null,null,null,null,"de"]
[]
[null,null,null,null,null,null,null,null,null,null,null,null,null,null,null,null,null,null,null,null,null,null,null,null,null,null,null,null,null,null,"WEB:",null," www.farremo.es",null,null,null,null,null,null,null,"email: ",null,null,"farremo@farremo.es"]

{"sheet":"USUARIOS","index":4,"n_rows":13,"n_cols":5,"rows_kept":13,"cut":false,"hidden":true,"merged":[]}
[]
[null,"LISTA DE USUARIOS"]
[]
[null,{"$f":"HOME!G13","v":0},{"$f":"VLOOKUP(B4,USUARIOS[[USUARIO]:[CONTRASEÑA]],2,FALSE)","v":{"$error":"#N/A"}},{"$f":"VLOOKUP(B4,USUARIOS[],3,FALSE)","v":{"$error":"#N/A"}},{"$f":"C4=HOME!$G$15","v":{"$error":"#N/A"}}]
[]
[null,"Id","USUARIO","CONTRASEÑA","Tipo Acceso"]
[null,1,"DESARROLLADOR","Zaragoza2024.","Desarrollador"]
[null,2,"PRESIDENTE","PRESIDENTE2024","Administrador"]
[null,3,"CENTRO NATACION HELIOS","HELIOS2024","Usuario"]
[null,4,"NAUTICO ZARAGOZA","NAUTICOZ2024","Usuario"]
[null,5,"OS NABATERS D.F.","NABATERS2024","Usuario"]
[null,6,"CAPRI MEQUINENZA","CAPRI2024","Usuario"]
[null,7,"ARAGON REMO","ARAGONR2024","Usuario"]

{"sheet":"NIVEL ACCESO","index":5,"n_rows":10,"n_cols":4,"rows_kept":10,"cut":false,"hidden":true,"merged":[]}
[]
[]
[]
[]
[]
[]
[null,"ID","Tipo Usuario","Nivel de Acceso"]
[null,1,"Administrador","Acceso a todas las hojas y escritura. Crear Usuarios"]
[null,2,"Administrador1","Acceso a INSCRIPCIONES y DATOS DEPORTISTAS"]
[null,3,"Usuario","Acceso a INSCRIPCIONES"]

{"sheet":"DATOS DEPORTISTAS","index":6,"n_rows":646,"n_cols":69,"rows_kept":646,"cut":false,"hidden":true,"merged":[]}
[1,2,3,4,5,6,7,8,9,10,11,12,13,null,null,null,null,null,null,null,null,"2025-01-01",null,null,2025,null,null,null,2024]
[null,null,null,null,null,null,null,null,null,null,null,null,"COLUMNA ROJO ¡NO TOCAR!"]
["FEM.","BEN.","ALE.","INF.","CAD.","JUV.","SEN.","VET.","CAT.","SEXO (M/F)","APELLIDOS","NOMBRE","NOMBRE COMPLETO","DNI","F. NAC.","AÑO","EDAD EN EL AÑO","MES","EDAD ACTUAL","FECHA TRAMITACIÓN ALTA LICENCIA","Nº LICENCIA","CLUB","LICENCIA FAR DEPORTISTA","LICENCIA FAR ENTRENADOR","LICENCIA FAR DELEGADO","LICENCIA FAR ARBITRO","AUTORIZACION CLUB LICENCIA FER","DATOS ENVÍO COMUNICACIONES","DATOS GRABACIÓN IMAGEN Y VIDEOS INTERNOS","DATOS GRABACIÓN IMAGEN Y VIDEOS RRSS","DATOS GRABACIÓN IMAGEN Y VIDEOS PARA EXTERNOS","LICENCIA FER DEPORTISTA","LICENCIA FER ENTRENADOR","LICENCIA FER DELEGADO","LICENCIA FER ARBITRO"]
[{"$f":"IF(J4=\"F\", 1,0)","v":1},{"$f":"IF(I4=\"BENJAMIN\", 1,0)","v":0},{"$f":"IF(I4=\"ALEVIN\", 1,0)","v":0},{"$f":"IF(I4=\"INFANTIL\", 1,0)","v":0},{"$f":"IF(I4=\"CADETE\", 1,0)","v":0},{"$f":"IF(I4=\"JUVENIL\", 1,0)","v":0},{"$f":"IF(I4=\"SENIOR\", 1,0)","v":0},{"$f":"IF(I4=\"VETERANO\", 1,0)","v":1},{"$f":"IF((Q4<11),\"BENJAMIN\",IF(OR(Q4=11,Q4=12),\"ALEVIN\",IF(OR(Q4=13,Q4=14),\"INFANTIL\",IF(OR(Q4=15,Q4=16),\"CADETE\",IF(OR(Q4=17,Q4=18),\"JUVENIL\",IF(AND(Q4>18,Q4<31),\"SENIOR\",\"VETERANO\"))))))","v":"VETERANO"},"F","ELVIRA ATIENZA","PILAR",{"$f":"L4&\" \"& K4","v":"PILAR ELVIRA ATIENZA"},"17012250R","1935-06-29",{"$f":"YEAR(O4)","v":1935},{"$f":"$Y$1-P4","v":90},{"$f":"MONTH(O4)","v":6},{"$f":"DATEDIF(O4,TODAY(),\"Y\")","v":90},null,1,"F.A.R.",1]
[{"$f":"IF(J5=\"F\", 1,0)","v":0},{"$f":"IF(I5=\"BENJAMIN\", 1,0)","v":0},{"$f":"IF(I5=\"ALEVIN\", 1,0)","v":0},{"$f":"IF(I5=\"INFANTIL\", 1,0)","v":0},{"$f":"IF(I5=\"CADETE\", 1,0)","v":0},{"$f":"IF(I5=\"JUVENIL\", 1,0)","v":0},{"$f":"IF(I5=\"SENIOR\", 1,0)","v":0},{"$f":"IF(I5=\"VETERANO\", 1,0)","v":1},"VETERANO","M","GASCÓN GONZÁLEZ","MIGUEL","MIGUEL GASCÓN GONZÁLEZ","17666633B","1940-02-22",1940,85,2,85,"2025-01-03",2,"F.A.R.",null,1]
[0,0,0,0,0,0,0,1,"VETERANO","M","GONZÁLEZ-ARCE LABORDA","JOSÉ JAVIER","JOSÉ JAVIER GONZÁLEZ-ARCE LABORDA","25157839W","1971-01-25",1971,54,1,54,"2025-01-03",3,"F.A.R.",null,null,null,1]
[0,0,0,0,0,0,0,1,"VETERANO","M","GÓMEZ RODRÍGUEZ","MARCOS","MARCOS GÓMEZ RODRÍGUEZ","17742359K","1974-04-21",1974,51,4,51,"2025-01-03",4,"F.A.R.",null,null,null,1]
[0,0,0,0,0,0,0,1,"VETERANO","M","CASORRÁN ROYO","DANIEL","DANIEL CASORRÁN ROYO","29111055R","1974-09-28",1974,51,9,51,"2025-01-03",5,"F.A.R.",null,null,null,1]
[0,0,0,0,0,0,0,1,"VETERANO","M","LLOP ROCA","JOSÉ MIGUEL","JOSÉ MIGUEL LLOP ROCA","40889536K","1965-03-30",1965,60,3,60,"2025-01-03",6,"F.A.R.",null,null,null,1]
[0,0,0,0,0,0,0,1,"VETERANO","M","MORALES ALCUBIERRE","PEDRO JAVIER","PEDRO JAVIER MORALES ALCUBIERRE","29113029C","1973-06-29",1973,52,6,52,"2025-01-03",7,"F.A.R.",null,null,null,1]
[0,0,0,0,0,0,0,1,"VETERANO","M","MARTÍNEZ CABELLO","PEDRO IGNACIO","PEDRO IGNACIO MARTÍNEZ CABELLO","17694366Y","1957-04-24",1957,68,4,68,null,8,"F.A.R.",null,null,null,1]
[0,0,0,0,0,0,0,1,"VETERANO","M","MARTÍNEZ BERMEJO","IGNACIO","IGNACIO MARTÍNEZ BERMEJO","25170248Z","1978-06-15",1978,47,6,47,null,9,"F.A.R.",null,null,null,1]
[1,0,0,0,0,0,0,1,"VETERANO","F","GALLARDO BENÍTEZ","MARÍA JOSÉ","MARÍA JOSÉ GALLARDO BENÍTEZ","74696036V","1985-11-28",1985,40,11,40,null,10,"F.A.R."]
[0,0,0,0,0,0,0,1,"VETERANO","M","AGUILERA ANDRÉS","ÁNGEL","ÁNGEL AGUILERA ANDRÉS","17178108Y","1949-11-07",1949,76,11,76,null,11,"F.A.R."]
[1,0,0,0,0,0,0,1,"VETERANO","F","CASTELLÓ AYED","BEATRIZ","BEATRIZ CASTELLÓ AYED","29476777E","1977-05-19",1977,48,5,48,"2025-01-03",12,"F.A.R.",null,null,null,1]
[0,0,0,0,0,0,0,1,"VETERANO","M","BARCELÓ LISO","LLUIS ANTONI","LLUIS ANTONI BARCELÓ LISO","36523549D","1976-11-23",1976,49,11,49,null,13,"F.A.R."]
[0,0,0,0,0,0,0,1,"VETERANO",null,"CUNCHILLOS PASCUAL","BEATRIZ","BEATRIZ CUNCHILLOS PASCUAL","29115835C","1978-10-05",1978,47,10,47,null,14,"F.A.R."]
[0,{"$f":"IF(I18=\"BENJAMIN\", 1,0)","v":1},{"$f":"IF(I18=\"ALEVIN\", 1,0)","v":0},{"$f":"IF(I18=\"INFANTIL\", 1,0)","v":0},{"$f":"IF(I18=\"CADETE\", 1,0)","v":0},{"$f":"IF(I18=\"JUVENIL\", 1,0)","v":0},{"$f":"IF(I18=\"SENIOR\", 1,0)","v":0},{"$f":"IF(I18=\"VETERANO\", 1,0)","v":0},"BENJAMIN",null,null,null," ",null,null,null,null,null,null,null,15,"F.A.R."]
[{"$f":"IF(J19=\"F\", 1,0)","v":0},{"$f":"IF(I19=\"BENJAMIN\", 1,0)","v":1},{"$f":"IF(I19=\"ALEVIN\", 1,0)","v":0},{"$f":"IF(I19=\"INFANTIL\", 1,0)","v":0},{"$f":"IF(I19=\"CADETE\", 1,0)","v":0},{"$f":"IF(I19=\"JUVENIL\", 1,0)","v":0},{"$f":"IF(I19=\"SENIOR\", 1,0)","v":0},0,"BENJAMIN",null,null,null," ",null,null,null,null,null,null,null,16,"F.A.R."]
[0,1,0,0,0,0,0,0,"BENJAMIN",null,null,null," ",null,null,null,null,null,null,null,17,"F.A.R."]
[0,1,0,0,0,0,0,0,"BENJAMIN",null,null,null," ",null,null,null,null,null,null,null,18,"F.A.R."]
[0,1,0,0,0,0,0,0,"BENJAMIN",null,null,null," ",null,null,null,null,null,null,null,19,"F.A.R."]
[0,1,0,0,0,0,0,0,"BENJAMIN",null,null,null," ",null,null,null,null,null,null,null,20,"F.A.R."]
[0,0,0,0,0,0,0,1,"VETERANO","M","MILLÁN MAINAR","FERNANDO CARLOS","FERNANDO CARLOS MILLÁN MAINAR","17843404G","1951-10-02",1951,74,10,74,"2025-01-03",21,"ARAGÓN REMO",1,null,null,null,1,1,1,1,1,null,null,null,null,null,null,null,null,null,null,null,null,null,null,null,null,null,null,null,null,null,null,null,null,null,null,null,null,null,null,null,null,null,null,{"$f":"AJ24+AL24+AN24+AP24+AR24+AT24+AV24+AX24+AZ24+BB24+BD24+BF24+BH24+BJ24+BL24","v":0},0]
[1,0,0,0,0,0,0,1,"VETERANO","F","GÓMEZ GÓMEZ","SOFÍA EVA","SOFÍA EVA GÓMEZ GÓMEZ","29111555H","1973-08-27",1973,52,8,52,"2025-01-03",22,"ARAGÓN REMO",1,null,null,null,1,1,1,1,1,null,null,null,null,null,null,null,null,null,null,null,null,null,null,null,null,null,null,null,null,null,null,null,null,null,null,null,null,null,null,null,null,1,1,1,1]
[0,0,0,0,0,0,0,1,"VETERANO","M","SAN JOSÉ SANTAMARÍA","DAVID","DAVID SAN JOSÉ SANTAMARÍA","25168929Y","1980-12-31",1980,45,12,44,"2025-01-03",23,"ARAGÓN REMO",null,1,null,null,1,1,1,1,1,null,null,null,null,null,null,null,null,null,null,null,null,null,null,null,null,null,null,null,null,null,null,null,null,null,null,null,null,null,null,null,null,null,null,0,0]
[0,0,0,0,0,0,1,0,"SENIOR","M","GARCÍA RUIZ","ALBERTO","ALBERTO GARCÍA RUIZ","73219311D","2002-01-19",2002,23,1,23,"2025-01-03",24,"CENTRO NATACION HELIOS",1,null,null,null,1,1,1,1,1,null,null,null,null,null,null,null,null,null,null,1,1,null,null,null,null,null,null,null,null,null,null,null,null,null,null,null,null,null,null,null,null,1,1,{"$f":"AJ27+AL27+AN27+AP27+AR27+AT27+AV27+AX27+AZ27+BB27+BD27+BF27+BH27+BJ27+BL27","v":2},2]
[0,0,0,0,0,0,0,1,"VETERANO","M","MUNIESA FERRERO","ALFONSO","ALFONSO MUNIESA FERRERO","17221336V","1964-10-11",1964,61,10,61,"2025-01-03",25,"CENTRO NATACION HELIOS",1,1,1,null,1,0,1,1,1,null,null,null,null,null,null,null,null,null,null,1,1,null,null,null,null,null,null,null,null,null,null,null,null,null,null,null,null,null,null,null,null,1,1,2,2,1,1]
[0,{"$f":"IF(I29=\"BENJAMIN\", 1,0)","v":0},{"$f":"IF(I29=\"ALEVIN\", 1,0)","v":0},{"$f":"IF(I29=\"INFANTIL\", 1,0)","v":0},{"$f":"IF(I29=\"CADETE\", 1,0)","v":1},{"$f":"IF(I29=\"JUVENIL\", 1,0)","v":0},{"$f":"IF(I29=\"SENIOR\", 1,0)","v":0},{"$f":"IF(I29=\"VETERANO\", 1,0)","v":0},"CADETE","M","PERNIA OYAGA","ÁNGEL","ÁNGEL PERNIA OYAGA","26275907V","2009-07-31",2009,16,7,16,"2025-01-03",26,"CENTRO NATACION HELIOS",1,null,null,null,1,1,1,1,1,null,null,null,null,null,null,null,null,null,null,1,1,null,null,null,null,null,null,null,null,null,null,null,null,null,null,null,null,null,null,null,null,1,1,2,2]
[0,{"$f":"IF(I30=\"BENJAMIN\", 1,0)","v":0},{"$f":"IF(I30=\"ALEVIN\", 1,0)","v":0},{"$f":"IF(I30=\"INFANTIL\", 1,0)","v":1},{"$f":"IF(I30=\"CADETE\", 1,0)","v":0},{"$f":"IF(I30=\"JUVENIL\", 1,0)","v":0},{"$f":"IF(I30=\"SENIOR\", 1,0)","v":0},0,"INFANTIL","M","IBÁÑEZ CUELLO","ANTONIO","ANTONIO IBÁÑEZ CUELLO","26798944B","2012-04-26",2012,13,4,13,"2025-01-03",27,"CENTRO NATACION HELIOS",1,null,null,null,1,1,1,1,1,null,null,null,null,null,null,null,null,null,null,1,0,null,null,null,null,null,null,null,null,null,null,null,null,null,null,null,null,null,null,null,null,null,null,1,0]
[0,0,1,0,0,0,0,0,"ALEVIN","M","IBÁÑEZ CUELLO","MANUEL","MANUEL IBÁÑEZ CUELLO","26798945N","2014-09-23",2014,11,9,11,"2025-01-03",28,"CENTRO NATACION HELIOS",1,null,null,null,1,1,1,1,1,null,null,null,null,null,null,null,null,null,null,1,0,null,null,null,null,null,null,null,null,null,null,null,null,null,null,null,null,null,null,null,null,null,null,1,0]
[1,0,0,0,1,0,0,0,"CADETE","F","ICHASO CEBADERO","IRENE","IRENE ICHASO CEBADERO","73445718W","2009-10-20",2009,16,10,16,"2025-01-03",29,"CENTRO NATACION HELIOS",1,null,null,null,1,1,1,1,1,null,null,null,null,null,null,null,null,null,null,1,0,null,null,null,null,null,null,null,null,null,null,null,null,null,null,null,null,null,null,null,null,1,1,2,1]
[0,0,0,0,0,1,0,0,"JUVENIL","M","CALZADA LARA","JONÁS","JONÁS CALZADA LARA","73055546W","2008-06-04",2008,17,6,17,"2025-01-03",30,"CENTRO NATACION HELIOS",1,null,null,null,1,1,1,1,1,null,null,null,null,null,null,null,null,null,null,1,0,null,null,null,null,null,null,null,null,null,null,null,null,null,null,null,null,null,null,null,null,null,null,1,0]
[1,0,0,0,0,0,0,1,"VETERANO","F","PINTO SOLANA","MARTA","MARTA PINTO SOLANA","25153195G","1969-06-10",1969,56,6,56,"2025-01-03",31,"CENTRO NATACION HELIOS",1,null,null,null,1,1,1,1,1,null,null,null,null,null,null,null,null,null,null,1,1,null,null,null,null,null,null,null,null,null,null,null,null,null,null,null,null,null,null,null,null,null,null,1,1]
[0,0,0,0,1,0,0,0,"CADETE","M","GASCÓN RAHONA","PABLO","PABLO GASCÓN RAHONA","73054804L","2010-08-07",2010,15,8,15,"2025-01-03",32,"CENTRO NATACION HELIOS",1,null,null,null,1,1,1,1,1,null,null,null,null,null,null,null,null,null,null,null,null,null,null,null,null,null,null,null,null,null,null,null,null,null,null,null,null,null,null,null,null,null,null,0,0]
[1,0,0,0,0,0,0,1,"VETERANO","F","GUTIÉRREZ GIMÉNEZ","TERESA","TERESA GUTIÉRREZ GIMÉNEZ","29101826H","1970-05-28",1970,55,5,55,"2025-01-03",33,"CENTRO NATACION HELIOS",1,null,null,null,1,1,1,1,1,null,null,null,null,null,null,null,null,null,null,1,1,null,null,null,null,null,null,null,null,null,null,null,null,null,null,null,null,null,null,null,null,null,null,1,1]
[1,0,0,1,0,0,0,0,"INFANTIL","F","GONZÁLEZ GARCÍA","ABRIL","ABRIL GONZÁLEZ GARCÍA","49756207P","2011-10-06",2011,14,10,14,"2025-01-03",34,"CAPRI MEQUINENZA",1,null,null,null,1,1,1,1,1,null,null,null,null,null,null,null,null,null,null,1,1,null,null,null,null,null,null,null,null,null,null,null,null,null,null,null,null,null,null,null,null,1,1,2,2]
[1,0,0,1,0,0,0,0,"INFANTIL","F","CUCHÍ NIUBÓ","ALBA","ALBA CUCHÍ NIUBÓ","49750595P","2011-06-27",2011,14,6,14,"2025-01-03",35,"CAPRI MEQUINENZA",1,null,null,null,1,1,1,1,1,null,null,null,null,null,null,null,null,null,null,1,1,null,null,null,null,null,null,null,null,null,null,null,null,null,null,null,null,null,null,null,null,1,1,2,2]
[1,0,1,0,0,0,0,0,"ALEVIN","F","MARTÍNEZ CLAVERO","ALBA","ALBA MARTÍNEZ CLAVERO","09825125P","2013-04-13",2013,12,4,12,"2025-01-03",36,"CAPRI MEQUINENZA",1,null,null,null,1,1,1,1,1,null,null,null,null,null,null,null,null,null,null,1,1,null,null,null,null,null,null,null,null,null,null,null,null,null,null,null,null,null,null,null,null,1,1,2,2]
[0,0,1,0,0,0,0,0,"ALEVIN","M","CATALÁN MOYA","ALEX","ALEX CATALÁN MOYA","09825089H","2014-10-16",2014,11,10,11,"2025-01-03",37,"CAPRI MEQUINENZA",1,null,null,null,1,1,1,1,1,null,null,null,null,null,null,null,null,null,null,null,null,null,null,null,null,null,null,null,null,null,null,null,null,null,null,null,null,null,null,null,null,null,null,0,0]
[0,0,0,0,1,0,0,0,"CADETE","M","VILELLA BERENGUER","ÁLEX","ÁLEX VILELLA BERENGUER","49254948B","2009-03-13",2009,16,3,16,"2025-01-03",38,"CAPRI MEQUINENZA",1,null,null,null,1,1,1,1,1,null,null,null,null,null,null,null,null,null,null,1,1,null,null,null,null,null,null,null,null,null,null,null,null,null,null,null,null,null,null,null,null,null,null,1,1]
[0,0,0,0,0,0,0,1,"VETERANO","M","PÉREZ ALONSO","ALFONSO","ALFONSO PÉREZ ALONSO","36076944H","1967-01-23",1967,58,1,58,"2025-01-03",39,"CAPRI MEQUINENZA",1,null,null,null,1,1,1,1,1,null,null,null,null,null,null,null,null,null,null,null,null,null,null,null,null,null,null,null,null,null,null,null,null,null,null,null,null,null,null,null,null,null,null,0,0]
[1,{"$f":"IF(I43=\"BENJAMIN\", 1,0)","v":0},{"$f":"IF(I43=\"ALEVIN\", 1,0)","v":0},{"$f":"IF(I43=\"INFANTIL\", 1,0)","v":1},{"$f":"IF(I43=\"CADETE\", 1,0)","v":0},{"$f":"IF(I43=\"JUVENIL\", 1,0)","v":0},{"$f":"IF(I43=\"SENIOR\", 1,0)","v":0},{"$f":"IF(I43=\"VETERANO\", 1,0)","v":0},"INFANTIL","F","CASTELLÓ VILA","AROA","AROA CASTELLÓ VILA","21748356Q","2011-10-17",2011,14,10,14,"2025-01-03",40,"CAPRI MEQUINENZA",1,null,null,null,1,1,1,1,1,null,null,null,null,null,null,null,null,null,null,1,1,null,null,null,null,null,null,null,null,null,null,null,null,null,null,null,null,null,null,null,null,1,1,2,2]
[{"$f":"IF(J44=\"F\", 1,0)","v":1},{"$f":"IF(I44=\"BENJAMIN\", 1,0)","v":1},{"$f":"IF(I44=\"ALEVIN\", 1,0)","v":0},{"$f":"IF(I44=\"INFANTIL\", 1,0)","v":0},{"$f":"IF(I44=\"CADETE\", 1,0)","v":0},{"$f":"IF(I44=\"JUVENIL\", 1,0)","v":0},{"$f":"IF(I44=\"SENIOR\", 1,0)","v":0},0,"BENJAMIN","F","RODES ESTRUGA","CARMEN","CARMEN RODES ESTRUGA","21749863M","2015-12-19",2015,10,12,10,"2025-01-03",41,"CAPRI MEQUINENZA",1,null,null,null,1,0,1,1,1,null,null,null,null,null,null,null,null,null,null,1,1,null,null,null,null,null,null,null,null,null,null,null,null,null,null,null,null,null,null,null,null,null,null,1,1]
[1,0,0,0,0,0,0,1,"VETERANO","F","CASTRO ARANDA","CONCEPCIÓN","CONCEPCIÓN CASTRO ARANDA","73155606N","1968-11-30",1968,57,11,57,"2025-01-03",42,"CAPRI MEQUINENZA",1,null,1,null,1,1,1,1,1,null,null,null,null,null,null,null,null,null,null,1,0,null,null,null,null,null,null,null,null,null,null,null,null,null,null,null,null,null,null,null,null,null,null,1,0]
[0,0,0,0,0,0,0,1,"VETERANO","M","CUCHÍ SAGARRA","DANIEL","DANIEL CUCHÍ SAGARRA","73157434T","1979-10-24",1979,46,10,46,"2025-01-03",43,"CAPRI MEQUINENZA",1,null,null,null,1,1,1,1,1,null,null,null,null,null,null,null,null,null,null,null,null,null,null,null,null,null,null,null,null,null,null,null,null,null,null,null,null,null,null,null,null,null,null,0,0]
[0,0,0,0,0,0,0,1,"VETERANO","M","OLIVER CABALLÉ","DAVID","DAVID OLIVER CABALLÉ","73157371Y","1981-01-05",1981,44,1,44,"2025-01-03",44,"CAPRI MEQUINENZA",null,1,null,null,1,1,1,1,1,null,null,null,null,null,null,null,null,null,null,null,null,null,null,null,null,null,null,null,null,null,null,null,null,null,null,null,null,null,null,null,null,null,null,0,0]
[0,0,0,0,1,0,0,0,"CADETE","M","AGUILAR ROMERO","DIEGO","DIEGO AGUILAR ROMERO","09826036E","2010-09-25",2010,15,9,15,"2025-01-03",45,"CAPRI MEQUINENZA",1,null,null,null,1,1,1,1,1,null,null,null,null,null,null,null,null,null,null,1,1,null,null,null,null,null,null,null,null,null,null,null,null,null,null,null,null,null,null,null,null,1,1,2,2]
[1,0,0,0,0,0,1,0,"SENIOR","F","STEGHERR LLOP","ELENA","ELENA STEGHERR LLOP","47983604S","2001-11-06",2001,24,11,24,"2025-01-03",46,"CAPRI MEQUINENZA",1,null,null,null,1,1,1,1,1,null,null,null,null,null,null,null,null,null,null,1,1,null,null,null,null,null,null,null,null,null,null,null,null,null,null,null,null,null,null,null,null,1,1,2,2]
[0,1,0,0,0,0,0,0,"BENJAMIN","M","EXPÓSITO SORO","ENZO","ENZO EXPÓSITO SORO","09826034C","2015-06-18",2015,10,6,10,"2025-01-03",47,"CAPRI MEQUINENZA",1,null,null,null,1,1,1,1,1,null,null,null,null,null,null,null,null,null,null,1,1,null,null,null,null,null,null,null,null,null,null,null,null,null,null,null,null,null,null,null,null,null,null,1,1]
[1,0,0,0,0,0,0,1,"VETERANO","F","ANDRÉS CARRILLO","ESTHER","ESTHER ANDRÉS CARRILLO","73082194Q","1983-09-04",1983,42,9,42,"2025-01-03",48,"CAPRI MEQUINENZA",1,null,null,null,1,1,1,1,1,null,null,null,null,null,null,null,null,null,null,null,null,null,null,null,null,null,null,null,null,null,null,null,null,null,null,null,null,null,null,null,null,null,null,0,0]
[1,{"$f":"IF(I52=\"BENJAMIN\", 1,0)","v":0},{"$f":"IF(I52=\"ALEVIN\", 1,0)","v":0},{"$f":"IF(I52=\"INFANTIL\", 1,0)","v":0},{"$f":"IF(I52=\"CADETE\", 1,0)","v":0},{"$f":"IF(I52=\"JUVENIL\", 1,0)","v":1},{"$f":"IF(I52=\"SENIOR\", 1,0)","v":0},{"$f":"IF(I52=\"VETERANO\", 1,0)","v":0},"JUVENIL","F","HIERRO GARCÍA","GISELA","GISELA HIERRO GARCÍA","79282536H","2007-11-05",2007,18,11,18,"2025-01-03",49,"CAPRI MEQUINENZA",1,null,null,null,1,1,1,1,1,null,null,null,null,null,null,null,null,null,null,1,1,null,null,null,null,null,null,null,null,null,null,null,null,null,null,null,null,null,null,null,null,1,1,2,2]
[0,{"$f":"IF(I53=\"BENJAMIN\", 1,0)","v":1},{"$f":"IF(I53=\"ALEVIN\", 1,0)","v":0},{"$f":"IF(I53=\"INFANTIL\", 1,0)","v":0},{"$f":"IF(I53=\"CADETE\", 1,0)","v":0},{"$f":"IF(I53=\"JUVENIL\", 1,0)","v":0},{"$f":"IF(I53=\"SENIOR\", 1,0)","v":0},0,"BENJAMIN","M","BLAS PEÑALVER","IBAI","IBAI BLAS PEÑALVER","21749866P","2016-03-19",2016,9,3,9,"2025-01-03",50,"CAPRI MEQUINENZA",1,null,null,null,1,1,1,1,1,null,null,null,null,null,null,null,null,null,null,1,1,null,null,null,null,null,null,null,null,null,null,null,null,null,null,null,null,null,null,null,null,null,null,1,1]
[0,0,1,0,0,0,0,0,"ALEVIN","M","SANJUÁN SATORRES","IKER","IKER SANJUÁN SATORRES","54989528R","2013-02-21",2013,12,2,12,"2025-01-03",51,"CAPRI MEQUINENZA",1,null,null,null,1,1,1,1,1,null,null,null,null,null,null,null,null,null,null,1,1,null,null,null,null,null,null,null,null,null,null,null,null,null,null,null,null,null,null,null,null,null,null,1,1]
[1,0,0,0,1,0,0,0,"CADETE","F","IBARZ BERENGUER","IRATXE","IRATXE IBARZ BERENGUER","52037048P","2009-03-08",2009,16,3,16,"2025-01-03",52,"CAPRI MEQUINENZA",1,null,null,null,1,1,1,1,1,null,null,null,null,null,null,null,null,null,null,null,null,null,null,null,null,null,null,null,null,null,null,null,null,null,null,null,null,null,null,null,null,1,1,1,1]
[1,0,0,0,1,0,0,0,"CADETE","F","BRUNA PALAU","IRENE","IRENE BRUNA PALAU","49759211E","2010-01-20",2010,15,1,15,"2025-01-03",53,"CAPRI MEQUINENZA",1,null,null,null,1,1,1,1,1,null,null,null,null,null,null,null,null,null,null,1,1,null,null,null,null,null,null,null,null,null,null,null,null,null,null,null,null,null,null,null,null,1,1,2,2]
[1,0,0,0,1,0,0,0,"CADETE","F","EXPÓSITO SORO","IRIA","IRIA EXPÓSITO SORO","21748355S","2010-05-04",2010,15,5,15,"2025-01-03",54,"CAPRI MEQUINENZA",1,null,null,null,1,1,1,1,1,null,null,null,null,null,null,null,null,null,null,1,0,null,null,null,null,null,null,null,null,null,null,null,null,null,null,null,null,null,null,null,null,null,null,1,0]
[0,0,0,0,1,0,0,0,"CADETE","M","RAHIBI VIDALLET","ISMAEL","ISMAEL RAHIBI VIDALLET","21765639A","2010-03-03",2010,15,3,15,"2025-01-03",55,"CAPRI MEQUINENZA",1,null,null,null,1,1,1,1,1,null,null,null,null,null,null,null,null,null,null,1,1,null,null,null,null,null,null,null,null,null,null,null,null,null,null,null,null,null,null,null,null,1,1,2,2]
[0,0,0,1,0,0,0,0,"INFANTIL","M","CASTELLNOU SOROLLA","IVÁN","IVÁN CASTELLNOU SOROLLA","49538212F","2012-01-19",2012,13,1,13,"2025-01-03",56,"CAPRI MEQUINENZA",1,null,null,null,1,0,1,1,1,null,null,null,null,null,null,null,null,null,null,1,1,null,null,null,null,null,null,null,null,null,null,null,null,null,null,null,null,null,null,null,null,null,null,1,1]
[0,1,0,0,0,0,0,0,"BENJAMIN","M","EXPÓSITO VARGAS","IVÁN","IVÁN EXPÓSITO VARGAS","21749862G","2016-03-02",2016,9,3,9,"2025-01-03",57,"CAPRI MEQUINENZA",1,null,null,null,1,1,1,1,1,null,null,null,null,null,null,null,null,null,null,null,null,null,null,null,null,null,null,null,null,null,null,null,null,null,null,null,null,null,null,null,null,null,null,0,0]
[0,0,1,0,0,0,0,0,"ALEVIN","M","CHERTÓ JIMÉNEZ","JOEL","JOEL CHERTÓ JIMÉNEZ","09825064Q","2014-03-18",2014,11,3,11,"2025-01-03",58,"CAPRI MEQUINENZA",1,null,null,null,1,0,1,1,1,null,null,null,null,null,null,null,null,null,null,1,1,null,null,null,null,null,null,null,null,null,null,null,null,null,null,null,null,null,null,null,null,1,1,2,2]
[0,0,0,0,0,0,0,1,"VETERANO","M","CASTELLÓ ROCA","JORDI","JORDI CASTELLÓ ROCA","17741096T","1978-10-16",1978,47,10,47,"2025-01-03",59,"CAPRI MEQUINENZA",null,null,1,null,1,1,1,1,1,null,null,null,null,null,null,null,null,null,null,null,null,null,null,null,null,null,null,null,null,null,null,null,null,null,null,null,null,null,null,null,null,null,null,0,0]
[0,0,0,0,0,0,0,1,"VETERANO","M","AGUILAR OLIVER","JORGE MANUEL","JORGE MANUEL AGUILAR OLIVER","73156551Z","1969-08-27",1969,56,8,56,"2025-01-03",60,"CAPRI MEQUINENZA",1,null,1,null,1,1,1,1,1,null,null,null,null,null,null,null,null,null,null,null,null,null,null,null,null,null,null,null,null,null,null,null,null,null,null,null,null,null,null,null,null,null,null,0,0]
[1,0,0,0,0,0,1,0,"SENIOR","F","RAMI CASTRO","JULIA","JULIA RAMI CASTRO","47980202V","1998-01-18",1998,27,1,27,"2025-01-03",61,"CAPRI MEQUINENZA",1,null,1,null,1,0,1,1,1,null,null,null,null,null,null,null,null,null,null,null,null,null,null,null,null,null,null,null,null,null,null,null,null,null,null,null,null,null,null,null,null,null,null,0,0]
[1,0,0,0,0,0,0,1,"VETERANO","F","NOGUÉS NICOLÁS","LORENA","LORENA NOGUÉS NICOLÁS","73157408C","1981-07-03",1981,44,7,44,"2025-01-03",62,"CAPRI MEQUINENZA",1,null,null,null,1,0,1,1,1,null,null,null,null,null,null,null,null,null,null,null,null,null,null,null,null,null,null,null,null,null,null,null,null,null,null,null,null,null,null,null,null,null,null,0,0]
[0,{"$f":"IF(I66=\"BENJAMIN\", 1,0)","v":0},{"$f":"IF(I66=\"ALEVIN\", 1,0)","v":0},{"$f":"IF(I66=\"INFANTIL\", 1,0)","v":0},{"$f":"IF(I66=\"CADETE\", 1,0)","v":0},{"$f":"IF(I66=\"JUVENIL\", 1,0)","v":0},{"$f":"IF(I66=\"SENIOR\", 1,0)","v":0},{"$f":"IF(I66=\"VETERANO\", 1,0)","v":1},"VETERANO","M","ESTEVE CATALÁN","LUIS","LUIS ESTEVE CATALÁN","73086543H","1990-04-18",1990,35,4,35,"2025-01-03",63,"CAPRI MEQUINENZA",1,null,null,null,1,0,1,1,1,null,null,null,null,null,null,null,null,null,null,null,null,null,null,null,null,null,null,null,null,null,null,null,null,null,null,null,null,null,null,null,null,null,null,0,0]
[1,{"$f":"IF(I67=\"BENJAMIN\", 1,0)","v":0},{"$f":"IF(I67=\"ALEVIN\", 1,0)","v":0},{"$f":"IF(I67=\"INFANTIL\", 1,0)","v":0},{"$f":"IF(I67=\"CADETE\", 1,0)","v":0},{"$f":"IF(I67=\"JUVENIL\", 1,0)","v":0},{"$f":"IF(I67=\"SENIOR\", 1,0)","v":0},1,"VETERANO","F","GARCÍA ARANDA","Mª CARMEN","Mª CARMEN GARCÍA ARANDA","45479315N","1974-02-23",1974,51,2,51,"2025-01-03",64,"CAPRI MEQUINENZA",null,null,1,null,1,1,1,1,1,null,null,null,null,null,null,null,null,null,null,null,null,null,null,null,null,null,null,null,null,null,null,null,null,null,null,null,null,null,null,null,null,null,null,0,0]
[1,0,0,0,0,0,0,1,{"$f":"IF((Q68<11),\"BENJAMIN\",IF(OR(Q68=11,Q68=12),\"ALEVIN\",IF(OR(Q68=13,Q68=14),\"INFANTIL\",IF(OR(Q68=15,Q68=16),\"CADETE\",IF(OR(Q68=17,Q68=18),\"JUVENIL\",IF(AND(Q68>18,Q68<31),\"SENIOR\",\"VETERANO\"))))))","v":"VETERANO"},"F","GODIA PI","MARÍA TERESA","MARÍA TERESA GODIA PI","73092010B","1989-08-13",{"$f":"YEAR(O68)","v":1989},{"$f":"$Y$1-P68","v":36},{"$f":"MONTH(O68)","v":8},{"$f":"DATEDIF(O68,TODAY(),\"Y\")","v":36},"2025-01-03",65,"CAPRI MEQUINENZA",1,null,1,null,1,1,1,1,1,null,null,null,null,null,null,null,null,null,null,1,1,null,null,null,null,null,null,null,null,null,null,null,null,null,null,null,null,null,null,null,null,1,1,2,2,1,1]
[0,{"$f":"IF(I69=\"BENJAMIN\", 1,0)","v":1},{"$f":"IF(I69=\"ALEVIN\", 1,0)","v":0},{"$f":"IF(I69=\"INFANTIL\", 1,0)","v":0},{"$f":"IF(I69=\"CADETE\", 1,0)","v":0},{"$f":"IF(I69=\"JUVENIL\", 1,0)","v":0},{"$f":"IF(I69=\"SENIOR\", 1,0)","v":0},{"$f":"IF(I69=\"VETERANO\", 1,0)","v":0},"BENJAMIN","M","CASTELLO VILA","MARC","MARC CASTELLO VILA","26607783A","2016-07-13",2016,9,7,9,"2025-01-03",66,"CAPRI MEQUINENZA",1,null,null,null,1,1,1,1,1,null,null,null,null,null,null,null,null,null,null,1,1,null,null,null,null,null,null,null,null,null,null,null,null,null,null,null,null,null,null,null,null,null,null,1,1]
[1,{"$f":"IF(I70=\"BENJAMIN\", 1,0)","v":1},{"$f":"IF(I70=\"ALEVIN\", 1,0)","v":0},{"$f":"IF(I70=\"INFANTIL\", 1,0)","v":0},{"$f":"IF(I70=\"CADETE\", 1,0)","v":0},{"$f":"IF(I70=\"JUVENIL\", 1,0)","v":0},{"$f":"IF(I70=\"SENIOR\", 1,0)","v":0},0,"BENJAMIN","F","AGUILAR ROMERO","MARÍA","MARÍA AGUILAR ROMERO","09826037T","2015-03-19",2015,10,3,10,"2025-01-03",67,"CAPRI MEQUINENZA",1,null,null,null,1,1,1,1,1,null,null,null,null,null,null,null,null,null,null,1,1,null,null,null,null,null,null,null,null,null,null,null,null,null,null,null,null,null,null,null,null,null,null,1,1]
[1,0,0,1,0,0,0,{"$f":"IF(I71=\"VETERANO\", 1,0)","v":0},{"$f":"IF((Q71<11),\"BENJAMIN\",IF(OR(Q71=11,Q71=12),\"ALEVIN\",IF(OR(Q71=13,Q71=14),\"INFANTIL\",IF(OR(Q71=15,Q71=16),\"CADETE\",IF(OR(Q71=17,Q71=18),\"JUVENIL\",IF(AND(Q71>18,Q71<31),\"SENIOR\",\"VETERANO\"))))))","v":"INFANTIL"},"F","ARROYO CABALLÉ","MARÍA","MARÍA ARROYO CABALLÉ","26319689F","2011-03-15",2011,14,3,14,"2025-01-03",68,"CAPRI MEQUINENZA",1,null,null,null,1,1,1,1,1,null,null,null,null,null,null,null,null,null,null,1,1,null,null,null,null,null,null,null,null,null,null,null,null,null,null,null,null,null,null,null,null,1,1,2,2]
[1,0,0,0,1,0,0,0,"CADETE","F","CATALÁN MOYA","MARINA","MARINA CATALÁN MOYA","49535632A","2010-10-25",2010,15,10,15,"2025-01-03",69,"CAPRI MEQUINENZA",1,null,null,null,1,1,1,1,1,null,null,null,null,null,null,null,null,null,null,1,1,null,null,null,null,null,null,null,null,null,null,null,null,null,null,null,null,null,null,null,null,1,1,2,2]
[0,0,0,0,0,0,0,1,"VETERANO","M","CLAVERO GARCÍA","MARISOL","MARISOL CLAVERO GARCÍA","73204563W","1981-04-10",1981,44,4,44,"2025-01-03",70,"CAPRI MEQUINENZA",1,null,1,null,1,1,1,1,1,null,null,null,null,null,null,null,null,null,null,null,null,null,null,null,null,null,null,null,null,null,null,null,null,null,null,null,null,null,null,null,null,null,null,0,0]
[0,1,0,0,0,0,0,0,"BENJAMIN","M","GUARDIOLA LOPERA","MAX","MAX GUARDIOLA LOPERA","26606631R","2016-08-28",2016,9,8,9,"2025-01-03",71,"CAPRI MEQUINENZA",1,null,null,null,1,1,1,1,1,null,null,null,null,null,null,null,null,null,null,1,1,null,null,null,null,null,null,null,null,null,null,null,null,null,null,null,null,null,null,null,null,null,null,1,1]
[0,0,0,0,0,0,1,0,"SENIOR","M","RUBIO LAMBEA","MIGUEL","MIGUEL RUBIO LAMBEA","73089974E","1998-07-27",1998,27,7,27,"2025-01-03",72,"CAPRI MEQUINENZA",1,null,null,null,1,1,1,1,1,null,null,null,null,null,null,null,null,null,null,null,null,null,null,null,null,null,null,null,null,null,null,null,null,null,null,null,null,null,null,null,null,null,null,0,0]
[1,0,0,0,1,0,0,0,"CADETE","F","BRUNA PALAU","MIRIAM","MIRIAM BRUNA PALAU","49759213R","2010-01-20",2010,15,1,15,"2025-01-03",73,"CAPRI MEQUINENZA",1,null,null,null,1,1,1,1,1,null,null,null,null,null,null,null,null,null,null,1,1,null,null,null,null,null,null,null,null,null,null,null,null,null,null,null,null,null,null,null,null,1,1,2,2]
[0,0,0,0,0,1,0,0,"JUVENIL","M","RAHIBI VIDALLET","MOHAMED ADAM","MOHAMED ADAM RAHIBI VIDALLET","21761862K","2008-08-09",2008,17,8,17,"2025-01-03",74,"CAPRI MEQUINENZA",1,null,null,null,1,1,1,1,1,null,null,null,null,null,null,null,null,null,null,1,1,null,null,null,null,null,null,null,null,null,null,null,null,null,null,null,null,null,null,null,null,1,1,2,2]
[1,0,1,0,0,0,0,0,"ALEVIN","F","ESTRUGA LLOP","ONA","ONA ESTRUGA LLOP","21749867D","2013-10-20",2013,12,10,12,"2025-01-03",75,"CAPRI MEQUINENZA",1,null,null,null,1,1,1,1,1,null,null,null,null,null,null,null,null,null,null,1,1,null,null,null,null,null,null,null,null,null,null,null,null,null,null,null,null,null,null,null,null,1,1,2,2]
[1,0,0,0,0,0,0,1,"VETERANO","F","JANIK","PATRYCJA","PATRYCJA JANIK","X9825718A","1979-05-24",1979,46,5,46,"2025-01-03",76,"CAPRI MEQUINENZA",1,null,1,null,1,1,1,1,1,null,null,null,null,null,null,null,null,null,null,null,null,null,null,null,null,null,null,null,null,null,null,null,null,null,null,null,null,null,null,null,null,null,null,0,0]
[1,1,0,0,0,0,0,0,"BENJAMIN","F","CUCHÍ NIUBÓ","PAULA","PAULA CUCHÍ NIUBÓ","21749861A","2016-01-25",2016,9,1,9,"2025-01-03",77,"CAPRI MEQUINENZA",1,null,null,null,1,1,1,1,1,null,null,null,null,null,null,null,null,null,null,1,1,null,null,null,null,null,null,null,null,null,null,null,null,null,null,null,null,null,null,null,null,null,null,1,1]
[0,0,0,0,1,0,0,0,"CADETE","M","GUIMERÁ JANIK","PAULO","PAULO GUIMERÁ JANIK","49260776C","2009-11-23",2009,16,11,16,"2025-01-03",78,"CAPRI MEQUINENZA",1,null,null,null,1,1,1,1,1,null,null,null,null,null,null,null,null,null,null,1,1,null,null,null,null,null,null,null,null,null,null,null,null,null,null,null,null,null,null,null,null,1,1,2,2]
[1,{"$f":"IF(I82=\"BENJAMIN\", 1,0)","v":0},{"$f":"IF(I82=\"ALEVIN\", 1,0)","v":0},{"$f":"IF(I82=\"INFANTIL\", 1,0)","v":0},{"$f":"IF(I82=\"CADETE\", 1,0)","v":0},{"$f":"IF(I82=\"JUVENIL\", 1,0)","v":0},{"$f":"IF(I82=\"SENIOR\", 1,0)","v":0},{"$f":"IF(I82=\"VETERANO\", 1,0)","v":1},"VETERANO","F","CABALLÉ SILVESTRE","RAQUEL","RAQUEL CABALLÉ SILVESTRE","73157378J","1977-06-14",1977,48,6,48,"2025-01-03",79,"CAPRI MEQUINENZA",1,null,1,null,1,1,1,1,1,null,null,null,null,null,null,null,null,null,null,null,null,null,null,null,null,null,null,null,null,null,null,null,null,null,null,null,null,null,null,null,null,null,null,0,0]
[1,{"$f":"IF(I83=\"BENJAMIN\", 1,0)","v":0},{"$f":"IF(I83=\"ALEVIN\", 1,0)","v":0},{"$f":"IF(I83=\"INFANTIL\", 1,0)","v":0},{"$f":"IF(I83=\"CADETE\", 1,0)","v":0},{"$f":"IF(I83=\"JUVENIL\", 1,0)","v":0},{"$f":"IF(I83=\"SENIOR\", 1,0)","v":0},{"$f":"IF(I83=\"VETERANO\", 1,0)","v":1},"VETERANO","F","NIUBÓ SOROLLA","ROSANA","ROSANA NIUBÓ SOROLLA","73205871E","1982-01-12",1982,43,1,43,"2025-01-03",80,"CAPRI MEQUINENZA",1,null,null,null,1,1,1,1,1,null,null,null,null,null,null,null,null,null,null,null,null,null,null,null,null,null,null,null,null,null,null,null,null,null,null,null,null,null,null,null,null,null,null,0,0]
[1,0,0,0,0,0,0,1,"VETERANO","F","ROMERO OLMOS","SARA ","SARA  ROMERO OLMOS","43445827T","1979-05-19",1979,46,5,46,"2025-01-03",81,"CAPRI MEQUINENZA",1,null,1,null,1,1,1,1,1,null,null,null,null,null,null,null,null,null,null,null,null,null,null,null,null,null,null,null,null,null,null,null,null,null,null,null,null,null,null,null,null,null,null,0,0]
[0,0,1,0,0,0,0,0,"ALEVIN","M","VIU NOGUÉS","SAÚL","SAÚL VIU NOGUÉS","21749415V","2014-03-06",2014,11,3,11,"2025-01-03",82,"CAPRI MEQUINENZA",1,null,null,null,1,0,1,1,1,null,null,null,null,null,null,null,null,null,null,1,1,null,null,null,null,null,null,null,null,null,null,null,null,null,null,null,null,null,null,null,null,1,1,2,2]
[0,0,0,0,0,0,0,1,"VETERANO","M","ESTRUGA GIMENO","VÍCTOR","VÍCTOR ESTRUGA GIMENO","73086539Z","1986-01-14",1986,39,1,39,"2025-01-03",83,"CAPRI MEQUINENZA",1,null,null,null,1,1,1,1,1,null,null,null,null,null,null,null,null,null,null,null,null,null,null,null,null,null,null,null,null,null,null,null,null,null,null,null,null,null,null,null,null,null,null,0,0]
[1,0,0,0,0,0,0,1,"VETERANO","F","SANTAELLA MAIRELES","VICTORIA","VICTORIA SANTAELLA MAIRELES","39719729V","1975-05-20",1975,50,5,50,"2025-01-03",84,"CAPRI MEQUINENZA",1,null,null,null,1,1,1,1,1,null,null,null,null,null,null,null,null,null,null,null,null,null,null,null,null,null,null,null,null,null,null,null,null,null,null,null,null,null,null,null,null,null,null,0,0]
[0,0,0,0,1,0,0,0,"CADETE","M","MARTÍNEZ CLAVERO","YERAY","YERAY MARTÍNEZ CLAVERO","49263892P","2009-05-06",2009,16,5,16,"2025-01-03",85,"CAPRI MEQUINENZA",1,null,null,null,1,1,1,1,1,null,null,null,null,null,null,null,null,null,null,1,1,null,null,null,null,null,null,null,null,null,null,null,null,null,null,null,null,null,null,null,null,1,1,2,2]
[1,0,0,0,0,0,1,0,"SENIOR","F","MANOSALVAS PILLAJO","CYNTHIA","CYNTHIA MANOSALVAS PILLAJO","73133951T","1996-03-13",1996,29,3,29,"2025-01-03",86,"CENTRO NATACION HELIOS",1,null,null,null,1,1,1,1,1,null,null,null,null,null,null,null,null,null,null,null,null,null,null,null,null,null,null,null,null,null,null,null,null,null,null,null,null,null,null,null,null,null,null,0,0]
[0,0,0,0,0,0,0,1,"VETERANO","M","MILLÁN BLASCO","CARLOS","CARLOS MILLÁN BLASCO","25170726D","1977-05-16",1977,48,5,48,"2025-01-03",87,"ARAGÓN REMO",1,null,1,null,1,1,1,1,1,null,null,null,null,1,null,1,null,null,null,null,null,null,null,null,null,null,null,null,null,null,null,null,null,null,null,null,null,null,null,null,null,null,null,2,0,null,1]
[0,0,0,0,0,0,0,1,"VETERANO","M","LABARTA PINILLA","JOSÉ MANUEL","JOSÉ MANUEL LABARTA PINILLA","25425646C","1964-08-07",1964,61,8,61,"2025-01-03",88,"ARAGÓN REMO",1,null,null,null,1,1,1,1,1,null,null,null,null,1,null,1,null,null,null,null,null,null,null,null,null,null,null,null,null,null,null,null,null,null,null,null,null,null,null,null,null,null,null,2,0,null,1]
[1,0,0,0,0,0,0,1,"VETERANO","F","AGUAS GARCIA","ESMERALDA","ESMERALDA AGUAS GARCIA","25435710X","1963-09-16",1963,62,9,62,"2025-01-03",89,"CENTRO NATACION HELIOS",1,1,null,null,null,null,null,null,null,null,null,null,null,null,null,null,null,null,null,1,1,null,null,null,null,null,null,null,null,null,null,null,null,null,null,null,null,null,null,null,null,null,null,1,1,null,1]
[0,0,0,0,0,1,0,0,"JUVENIL","M","ALONSO ROCHE","IKER","IKER ALONSO ROCHE","25361278Y","2008-12-27",2008,17,12,17,"2025-01-03",90,"CENTRO NATACION HELIOS",1,null,null,null,null,null,null,null,null,null,null,null,null,1,null,1,null,null,null,1,1,null,null,null,null,null,null,null,null,null,null,null,null,null,null,null,null,null,null,null,null,1,1,4,2]
[1,0,0,0,0,0,0,1,"VETERANO","F","ANGLÉS BEL","EVA MARÍA","EVA MARÍA ANGLÉS BEL","25455628X","1973-07-26",1973,52,7,52,"2025-01-03",91,"CENTRO NATACION HELIOS",1,null,null,null,null,null,null,null,null,null,null,null,null,1,null,1,null,null,null,1,1,null,null,null,null,null,null,null,null,null,null,null,null,null,null,null,null,null,null,null,null,1,1,4,2,null,1]
[0,0,0,0,0,0,0,1,"VETERANO","M","BARRACHINA RODRÍGUEZ","JAVIER","JAVIER BARRACHINA RODRÍGUEZ","25454763L","1972-05-02",1972,53,5,53,"2025-01-03",92,"CENTRO NATACION HELIOS",1,null,null,null,null,null,null,null,null,null,null,null,null,null,null,null,null,null,null,1,1,null,null,null,null,null,null,null,null,null,null,null,null,null,null,null,null,null,null,null,null,null,null,1,1]
[0,{"$f":"IF(I96=\"BENJAMIN\", 1,0)","v":0},{"$f":"IF(I96=\"ALEVIN\", 1,0)","v":0},{"$f":"IF(I96=\"INFANTIL\", 1,0)","v":0},{"$f":"IF(I96=\"CADETE\", 1,0)","v":0},{"$f":"IF(I96=\"JUVENIL\", 1,0)","v":0},{"$f":"IF(I96=\"SENIOR\", 1,0)","v":0},{"$f":"IF(I96=\"VETERANO\", 1,0)","v":1},"VETERANO","M","BIELSA ARTIDIELLO","JULIO","JULIO BIELSA ARTIDIELLO","17728131F","1969-03-29",1969,56,3,56,"2025-01-03",93,"CENTRO NATACION HELIOS",1,null,1,null,null,null,null,null,null,null,null,null,null,null,null,null,null,null,null,null,null,null,null,null,null,null,null,null,null,null,null,null,null,null,null,null,null,null,null,null,null,null,null,0,0]
[0,{"$f":"IF(I97=\"BENJAMIN\", 1,0)","v":0},{"$f":"IF(I97=\"ALEVIN\", 1,0)","v":0},{"$f":"IF(I97=\"INFANTIL\", 1,0)","v":0},{"$f":"IF(I97=\"CADETE\", 1,0)","v":0},{"$f":"IF(I97=\"JUVENIL\", 1,0)","v":0},{"$f":"IF(I97=\"SENIOR\", 1,0)","v":0},1,"VETERANO","M","BLANCO VELÁZQUEZ","ANDRÉS","ANDRÉS BLANCO VELÁZQUEZ","17737449X","1973-09-11",1973,52,9,52,"2025-01-03",94,"CENTRO NATACION HELIOS",1,null,null,null,null,null,null,null,null,null,null,null,null,null,null,null,null,null,null,null,null,null,null,null,null,null,null,null,null,null,null,null,null,null,null,null,null,null,null,null,null,null,null,0,0]
[0,0,0,0,0,0,1,0,"SENIOR","M","BRIZ ZAMORANO","PABLO","PABLO BRIZ ZAMORANO","17768134J","1997-03-19",1997,28,3,28,"2025-01-03",95,"CENTRO NATACION HELIOS",1,1,null,null,null,null,null,null,null,null,null,null,null,1,null,1,null,null,null,1,1,null,null,null,null,null,null,null,null,null,null,null,null,null,null,null,null,null,null,null,null,null,null,3,1,1,1]
[0,1,0,0,0,0,0,0,"BENJAMIN","M","BUEY DE SACADURA","LUIS","LUIS BUEY DE SACADURA","73615211P","2016-04-16",2016,9,4,9,"2025-01-03",96,"CENTRO NATACION HELIOS",1,null,null,null,null,null,null,null,null,null,null,null,null,1,null,1,null,null,null,1,1,null,null,null,null,null,null,null,null,null,null,null,null,null,null,null,null,null,null,null,null,null,null,3,1]
[0,0,0,0,0,1,0,0,"JUVENIL","M","CABELLO PIETRZAK","IREK","IREK CABELLO PIETRZAK","25209552B","2008-01-05",2008,17,1,17,"2025-01-03",97,"CENTRO NATACION HELIOS",1,null,null,null,null,null,null,null,null,null,null,null,null,1,null,1,null,null,null,1,1,null,null,null,null,null,null,null,null,null,null,null,null,null,null,null,null,null,null,null,null,1,1,4,2]
[0,0,0,0,0,0,0,1,"VETERANO","M","CALAVIA RODRÍGUEZ","JUAN CARLOS","JUAN CARLOS CALAVIA RODRÍGUEZ","25141750J","1964-08-09",1964,61,8,61,"2025-01-03",98,"CENTRO NATACION HELIOS",1,null,null,null,null,null,null,null,null,null,null,null,null,1,null,1,null,null,null,1,0,null,null,null,null,null,null,null,null,null,null,null,null,null,null,null,null,null,null,null,null,null,null,3,0,1]
[0,0,0,0,0,0,0,1,"VETERANO","M","CALVO GRACIA","JORGE OCTAVIO","JORGE OCTAVIO CALVO GRACIA","72987625T","1983-01-15",1983,42,1,42,"2025-01-03",99,"CENTRO NATACION HELIOS",1,null,null,null,null,null,null,null,null,null,null,null,null,null,null,null,null,null,null,1,1,null,null,null,null,null,null,null,null,null,null,null,null,null,null,null,null,null,null,null,null,1,1,2,2]
[0,{"$f":"IF(I103=\"BENJAMIN\", 1,0)","v":0},{"$f":"IF(I103=\"ALEVIN\", 1,0)","v":0},{"$f":"IF(I103=\"INFANTIL\", 1,0)","v":0},{"$f":"IF(I103=\"CADETE\", 1,0)","v":0},{"$f":"IF(I103=\"JUVENIL\", 1,0)","v":0},{"$f":"IF(I103=\"SENIOR\", 1,0)","v":0},{"$f":"IF(I103=\"VETERANO\", 1,0)","v":1},"VETERANO","M","CASAS GUILLÉN","ADRIÁN","ADRIÁN CASAS GUILLÉN","17764108N","1989-07-16",1989,36,7,36,"2025-01-03",100,"CENTRO NATACION HELIOS",1,null,null,null,null,null,null,null,null,null,null,null,null,null,null,null,null,null,null,null,null,null,null,null,null,null,null,null,null,null,null,null,null,null,null,null,null,null,null,null,null,null,null,0,0]
[0,{"$f":"IF(I104=\"BENJAMIN\", 1,0)","v":0},{"$f":"IF(I104=\"ALEVIN\", 1,0)","v":0},{"$f":"IF(I104=\"INFANTIL\", 1,0)","v":0},{"$f":"IF(I104=\"CADETE\", 1,0)","v":1},{"$f":"IF(I104=\"JUVENIL\", 1,0)","v":0},{"$f":"IF(I104=\"SENIOR\", 1,0)","v":0},{"$f":"IF(I104=\"VETERANO\", 1,0)","v":0},"CADETE","M","CAZADOR SERRANO","ERIC","ERIC CAZADOR SERRANO","25363173S","2010-03-11",2010,15,3,15,"2025-01-03",101,"CENTRO NATACION HELIOS",1,null,null,null,null,null,null,null,null,null,null,null,null,1,null,1,null,null,null,null,null,null,null,null,null,null,null,null,null,null,null,null,null,null,null,null,null,null,null,null,null,1,1,3,1]
[0,1,0,0,0,0,0,0,"BENJAMIN","M","CAZADOR SERRANO","UDAY","UDAY CAZADOR SERRANO","26589449T","2015-08-21",2015,10,8,10,"2025-01-03",102,"CENTRO NATACION HELIOS",1,null,null,null,null,null,null,null,null,null,null,null,null,null,null,null,null,null,null,null,null,null,null,null,null,null,null,null,null,null,null,null,null,null,null,null,null,null,null,null,null,null,null,0,0]
[0,0,0,0,0,0,0,1,"VETERANO","M","CILLEROS BLÁZQUEZ","EMILIO ANASTASIO","EMILIO ANASTASIO CILLEROS BLÁZQUEZ","17719575F","1966-08-08",1966,59,8,59,"2025-01-03",103,"CENTRO NATACION HELIOS",1,null,null,null,null,null,null,null,null,null,null,null,null,1,null,1,null,null,null,1,1,null,null,null,null,null,null,null,null,null,null,null,null,null,null,null,null,null,null,null,null,null,null,3,1,1]
[0,0,0,0,1,0,0,0,"CADETE","M","CINCA GARCÍA","VÍCTOR","VÍCTOR CINCA GARCÍA","73235309C","2009-04-01",2009,16,4,16,"2025-01-03",104,"CENTRO NATACION HELIOS",1,null,null,null,null,null,null,null,null,null,null,null,null,1,null,1,null,null,null,1,1,null,null,null,null,null,null,null,null,null,null,null,null,null,null,null,null,null,null,null,null,1,1,4,2]
[{"$f":"IF(J108=\"F\", 1,0)","v":0},0,0,0,0,0,0,1,"VETERANO","M","DE LAS CASAS JIMÉNEZ","DIEGO","DIEGO DE LAS CASAS JIMÉNEZ","72990208F","1990-11-25",1990,35,11,35,"2025-01-03",105,"CENTRO NATACION HELIOS",1,null,null,null,null,null,null,null,null,null,null,null,null,null,null,null,null,null,null,null,null,null,null,null,null,null,null,null,null,null,null,null,null,null,null,null,null,null,null,null,null,null,null,0,0]
[0,0,0,0,0,0,0,1,"VETERANO","M","DÍAZ ROBLES","ANDRÉS","ANDRÉS DÍAZ ROBLES","17707529J","1962-05-07",1962,63,5,63,"2025-01-03",106,"CENTRO NATACION HELIOS",1,null,null,null,null,null,null,null,null,null,null,null,null,1,null,1,null,null,null,null,null,null,null,null,null,null,null,null,null,null,null,null,null,null,null,null,null,null,null,null,null,null,null,2,0]
[0,0,0,0,0,0,1,0,"SENIOR","M","DIEZ GARCÍA","PEDRO","PEDRO DIEZ GARCÍA","25210785W","2006-06-13",2006,19,6,19,"2025-01-03",107,"CENTRO NATACION HELIOS",1,null,null,null,null,null,null,null,null,null,null,null,null,null,null,null,null,null,null,1,1,null,null,null,null,null,null,null,null,null,null,null,null,null,null,null,null,null,null,null,null,1,1,2,2]
[0,0,0,0,0,0,0,1,"VETERANO","M","DIEZ SECO","ALFREDO","ALFREDO DIEZ SECO","25458198G","1973-04-07",1973,52,4,52,"2025-01-03",108,"CENTRO NATACION HELIOS",1,null,null,null,null,null,null,null,null,null,null,null,null,1,null,1,null,null,null,1,1,null,null,null,null,null,null,null,null,null,null,null,null,null,null,null,null,null,null,null,null,1,1,4,2,null,1]
[1,1,0,0,0,0,0,0,"BENJAMIN","F","ESPADA CIPRÉS","JIMENA","JIMENA ESPADA CIPRÉS","30338022X","2017-06-29",2017,8,6,8,"2025-01-03",109,"CENTRO NATACION HELIOS",1,null,null,null,null,null,null,null,null,null,null,null,null,1,null,1,null,null,null,1,1,null,null,null,null,null,null,null,null,null,null,null,null,null,null,null,null,null,null,null,null,null,null,3,1]
[1,0,1,0,0,0,0,0,"ALEVIN","F","ESPADA CIPRÉS","VALENTINA","VALENTINA ESPADA CIPRÉS","30338021D","2013-03-01",2013,12,3,12,"2025-01-03",110,"CENTRO NATACION HELIOS",1,null,null,null,null,null,null,null,null,null,null,null,null,1,null,1,null,null,null,1,1,null,null,null,null,null,null,null,null,null,null,null,null,null,null,null,null,null,null,null,null,1,1,4,2]
[0,0,0,0,0,0,0,1,"VETERANO","M","ESTEBAN GRAN","VÍCTOR","VÍCTOR ESTEBAN GRAN","17702922Y","1959-11-23",1959,66,11,66,"2025-01-03",111,"CENTRO NATACION HELIOS",1,null,null,null,null,null,null,null,null,null,null,null,null,null,null,null,null,null,null,1,1,null,null,null,null,null,null,null,null,null,null,null,null,null,null,null,null,null,null,null,null,1,1,2,2]
[0,0,0,0,1,0,0,0,"CADETE","M","FAÑA GRIÑÓN","JOSÉ MANUEL","JOSÉ MANUEL FAÑA GRIÑÓN","73165419G","2009-04-01",2009,16,4,16,"2025-01-03",112,"CENTRO NATACION HELIOS",1,null,null,null,null,null,null,null,null,null,null,null,null,null,null,null,null,null,null,null,null,null,null,null,null,null,null,null,null,null,null,null,null,null,null,null,null,null,null,null,null,1,1,1,1]
[1,0,0,0,0,1,0,0,"JUVENIL","F","FUERTES VALLÉS","NOA","NOA FUERTES VALLÉS","73290681P","2008-07-28",2008,17,7,17,"2025-01-03",113,"CENTRO NATACION HELIOS",1,null,null,null,null,null,null,null,null,null,null,null,null,null,null,null,null,null,null,null,null,null,null,null,null,null,null,null,null,null,null,null,null,null,null,null,null,null,null,null,null,null,null,0,0]
[0,{"$f":"IF(I117=\"BENJAMIN\", 1,0)","v":0},{"$f":"IF(I117=\"ALEVIN\", 1,0)","v":0},{"$f":"IF(I117=\"INFANTIL\", 1,0)","v":0},{"$f":"IF(I117=\"CADETE\", 1,0)","v":0},{"$f":"IF(I117=\"JUVENIL\", 1,0)","v":0},{"$f":"IF(I117=\"SENIOR\", 1,0)","v":1},{"$f":"IF(I117=\"VETERANO\", 1,0)","v":0},"SENIOR","M","GASCÓN MARCHAL","TRISTÁN","TRISTÁN GASCÓN MARCHAL","30343411V","2002-05-17",2002,23,5,23,"2025-01-03",114,"CENTRO NATACION HELIOS",1,null,null,null,1,1,1,1,1,null,null,null,null,null,null,null,null,null,null,null,null,null,null,null,null,null,null,null,null,null,null,null,null,null,null,null,null,null,null,null,null,null,null,0,0]
[0,{"$f":"IF(I118=\"BENJAMIN\", 1,0)","v":0},{"$f":"IF(I118=\"ALEVIN\", 1,0)","v":0},{"$f":"IF(I118=\"INFANTIL\", 1,0)","v":0},{"$f":"IF(I118=\"CADETE\", 1,0)","v":0},{"$f":"IF(I118=\"JUVENIL\", 1,0)","v":1},{"$f":"IF(I118=\"SENIOR\", 1,0)","v":0},0,"JUVENIL","M","GIRONÉS BENAVENTE","MANUEL","MANUEL GIRONÉS BENAVENTE","73414963K","2008-04-15",2008,17,4,17,"2025-01-03",115,"CENTRO NATACION HELIOS",1,null,null,null,null,null,null,null,null,null,null,null,null,null,null,null,null,null,null,1,1,null,null,null,null,null,null,null,null,null,null,null,null,null,null,null,null,null,null,null,null,1,1,2,2]
[0,0,0,1,0,0,0,0,"INFANTIL","M","GUTIÉRREZ ANDOLZ","GUILLERMO","GUILLERMO GUTIÉRREZ ANDOLZ","73236703B","2011-10-13",2011,14,10,14,"2025-01-03",116,"CENTRO NATACION HELIOS",1,null,null,null,null,null,null,null,null,null,null,null,null,null,null,null,null,null,null,1,1,null,null,null,null,null,null,null,null,null,null,null,null,null,null,null,null,null,null,null,null,1,1,2,2]
[0,0,0,1,0,0,0,0,"INFANTIL","M","IGLESIAS DELGADO","IAGO","IAGO IGLESIAS DELGADO","77761979Z","2011-10-16",2011,14,10,14,"2025-01-03",117,"CENTRO NATACION HELIOS",1,null,null,null,null,null,null,null,null,null,null,null,null,null,null,null,null,null,null,null,null,null,null,null,null,null,null,null,null,null,null,null,null,null,null,null,null,null,null,null,null,null,null,0,0]
[0,0,0,0,0,1,0,0,"JUVENIL","M","JIMÉNEZ HORNOS","DIEGO","DIEGO JIMÉNEZ HORNOS","26795241B","2008-07-19",2008,17,7,17,"2025-01-03",118,"CENTRO NATACION HELIOS",1,null,null,null,null,null,null,null,null,null,null,null,null,null,null,null,null,null,null,1,1,null,null,null,null,null,null,null,null,null,null,null,null,null,null,null,null,null,null,null,null,null,null,1,1]
[0,0,0,0,0,0,1,0,"SENIOR","M","JURADO PÉREZ","ALEXANDER","ALEXANDER JURADO PÉREZ","25362246P","2006-06-22",2006,19,6,19,"2025-01-03",119,"CENTRO NATACION HELIOS",1,null,null,null,null,null,null,null,null,null,null,null,null,null,null,null,null,null,null,1,1,null,null,null,null,null,null,null,null,null,null,null,null,null,null,null,null,null,null,null,null,1,1,2,2]
[0,0,0,0,0,0,0,1,"VETERANO","M","LACASTA AISA","JOSÉ","JOSÉ LACASTA AISA","25154088T","1969-07-14",1969,56,7,56,"2025-01-03",120,"CENTRO NATACION HELIOS",1,null,null,null,null,null,null,null,null,null,null,null,null,null,null,null,null,null,null,null,null,null,null,null,null,null,null,null,null,null,null,null,null,null,null,null,null,null,null,null,null,null,null,0,0]
[0,0,0,0,0,0,1,0,"SENIOR","M","LACRUZ SANZ","FRANCISCO DE ASÍS","FRANCISCO DE ASÍS LACRUZ SANZ","73471366M","2001-03-31",2001,24,3,24,"2025-01-03",121,"CENTRO NATACION HELIOS",1,null,null,null,null,null,null,null,null,null,null,null,null,null,null,null,null,null,null,null,null,null,null,null,null,null,null,null,null,null,null,null,null,null,null,null,null,null,null,null,null,null,null,0,0]
[0,{"$f":"IF(I125=\"BENJAMIN\", 1,0)","v":0},{"$f":"IF(I125=\"ALEVIN\", 1,0)","v":0},{"$f":"IF(I125=\"INFANTIL\", 1,0)","v":0},{"$f":"IF(I125=\"CADETE\", 1,0)","v":0},{"$f":"IF(I125=\"JUVENIL\", 1,0)","v":0},{"$f":"IF(I125=\"SENIOR\", 1,0)","v":0},{"$f":"IF(I125=\"VETERANO\", 1,0)","v":1},"VETERANO","M","LATAS JIMÉNEZ","IVÁN","IVÁN LATAS JIMÉNEZ","29126653M","1981-04-19",1981,44,4,44,"2025-01-03",122,"CENTRO NATACION HELIOS",1,1,null,null,null,null,null,null,null,null,null,null,null,null,null,null,null,null,null,1,0,null,null,null,null,null,null,null,null,null,null,null,null,null,null,null,null,null,null,null,null,null,null,1,0,1]
[0,{"$f":"IF(I126=\"BENJAMIN\", 1,0)","v":0},{"$f":"IF(I126=\"ALEVIN\", 1,0)","v":0},{"$f":"IF(I126=\"INFANTIL\", 1,0)","v":1},{"$f":"IF(I126=\"CADETE\", 1,0)","v":0},{"$f":"IF(I126=\"JUVENIL\", 1,0)","v":0},{"$f":"IF(I126=\"SENIOR\", 1,0)","v":0},{"$f":"IF(I126=\"VETERANO\", 1,0)","v":0},"INFANTIL","M","LÁZARO QUÍLEZ","BRUNO","BRUNO LÁZARO QUÍLEZ","73271696K","2011-08-30",2011,14,8,14,"2025-01-03",123,"CENTRO NATACION HELIOS",1,null,null,null,null,null,null,null,null,null,null,null,null,null,null,null,null,null,null,null,null,null,null,null,null,null,null,null,null,null,null,null,null,null,null,null,null,null,null,null,null,null,null,0,0]
[0,0,0,0,0,0,1,0,"SENIOR","M","LERMA IRURETA","JUAN","JUAN LERMA IRURETA","17771602P","2001-09-04",2001,24,9,24,"2025-01-03",124,"CENTRO NATACION HELIOS",1,null,null,null,null,null,null,null,null,null,null,null,null,null,null,null,null,null,null,null,null,null,null,null,null,null,null,null,null,null,null,null,null,null,null,null,null,null,null,null,null,null,null,0,0,null,1]
[1,0,0,1,0,0,0,0,"INFANTIL","F","LUNA MONTAGUD","ALICIA","ALICIA LUNA MONTAGUD","17472004P","2012-09-02",2012,13,9,13,"2025-01-03",125,"CENTRO NATACION HELIOS",1,null,null,null,null,null,null,null,null,null,null,null,null,null,null,null,null,null,null,1,1,null,null,null,null,null,null,null,null,null,null,null,null,null,null,null,null,null,null,null,null,1,1,2,2]
[0,0,1,0,0,0,0,0,"ALEVIN","M","LUNA MONTAGUD","JORGE","JORGE LUNA MONTAGUD","73622251X","2014-04-27",2014,11,4,11,"2025-01-03",126,"CENTRO NATACION HELIOS",1,null,null,null,null,null,null,null,null,null,null,null,null,null,null,null,null,null,null,1,1,null,null,null,null,null,null,null,null,null,null,null,null,null,null,null,null,null,null,null,null,1,1,2,2]
[0,0,0,0,0,1,0,0,"JUVENIL","M","MALO VELA","PABLO","PABLO MALO VELA","73237255B","2008-09-08",2008,17,9,17,"2025-01-03",127,"CENTRO NATACION HELIOS",1,null,null,null,null,null,null,null,null,null,null,null,null,null,null,null,null,null,null,1,1,null,null,null,null,null,null,null,null,null,null,null,null,null,null,null,null,null,null,null,null,1,1,2,2]
[1,0,0,0,0,0,1,0,"SENIOR","F","MARCÉN GUTIÉRREZ","PILAR","PILAR MARCÉN GUTIÉRREZ","73428934P","2006-03-09",2006,19,3,19,"2025-01-03",128,"CENTRO NATACION HELIOS",1,null,null,null,null,null,null,null,null,null,null,null,null,null,null,null,null,null,null,1,1,null,null,null,null,null,null,null,null,null,null,null,null,null,null,null,null,null,null,null,null,1,1,2,2]
[0,0,0,0,0,1,0,0,"JUVENIL","M","MARTÍN BERNARDOS","NIL","NIL MARTÍN BERNARDOS","17460920X","2008-10-19",{"$f":"YEAR(O132)","v":2008},17,{"$f":"MONTH(O132)","v":10},{"$f":"DATEDIF(O132,TODAY(),\"Y\")","v":17},"2025-01-03",129,"CENTRO NATACION HELIOS",1,null,null,null,null,null,null,null,null,null,null,null,null,null,null,null,null,null,null,1,1,null,null,null,null,null,null,null,null,null,null,null,null,null,null,null,null,null,null,null,null,1,1,2,2]
[0,0,0,0,1,0,0,0,"CADETE","M","MARTÍN RANERA","FERNANDO","FERNANDO MARTÍN RANERA","26055852A","2009-06-27",2009,{"$f":"$Y$1-P133","v":16},6,16,"2025-01-03",130,"CENTRO NATACION HELIOS",1,null,null,null,null,null,null,null,null,null,null,null,null,null,null,null,null,null,null,1,1,null,null,null,null,null,null,null,null,null,null,null,null,null,null,null,null,null,null,null,null,1,1,2,2]
[0,0,0,0,0,1,0,0,"JUVENIL","M","MELÉNDEZ DEL PICO","MARCO","MARCO MELÉNDEZ DEL PICO","73427660E","2008-11-21",2008,17,11,17,"2025-01-03",131,"CENTRO NATACION HELIOS",1,null,null,null,null,null,null,null,null,null,null,null,null,null,null,null,null,null,null,1,1,null,null,null,null,null,null,null,null,null,null,null,null,null,null,null,null,null,null,null,null,1,1,2,2]
[1,0,0,0,1,0,0,0,"CADETE","F","MILLÁN GÓMEZ","CHLOÉ","CHLOÉ MILLÁN GÓMEZ","77219625T","2009-05-05",2009,16,5,16,"2025-01-03",132,"CENTRO NATACION HELIOS",1,null,null,null,null,null,null,null,null,null,null,null,null,null,null,null,null,null,null,null,null,null,null,null,null,null,null,null,null,null,null,null,null,null,null,null,null,null,null,null,null,null,null,0,0]
[0,0,0,1,0,0,0,0,"INFANTIL","M","MILLÁN GÓMEZ","MARTÍN","MARTÍN MILLÁN GÓMEZ","73052578R","2011-05-16",2011,14,5,14,"2025-01-03",133,"CENTRO NATACION HELIOS",1,null,null,null,null,null,null,null,null,null,null,null,null,null,null,null,null,null,null,1,1,null,null,null,null,null,null,null,null,null,null,null,null,null,null,null,null,null,null,null,null,1,1,2,2]
[1,0,1,0,0,0,0,0,"ALEVIN","F","MONTANER ALFARO","LUCÍA","LUCÍA MONTANER ALFARO","73514253C","2013-05-17",2013,12,5,12,"2025-01-03",134,"CENTRO NATACION HELIOS",1,null,null,null,null,null,null,null,null,null,null,null,null,null,null,null,null,null,null,1,1,null,null,null,null,null,null,null,null,null,null,null,null,null,null,null,null,null,null,null,null,1,1,2,2]
[0,0,0,0,0,1,0,0,"JUVENIL","M","MONTANER ALFARO","MARTÍN","MARTÍN MONTANER ALFARO","73514251H","2008-06-27",2008,17,6,17,"2025-01-03",135,"CENTRO NATACION HELIOS",1,null,null,null,null,null,null,null,null,null,null,null,null,null,null,null,null,null,null,1,1,null,null,null,null,null,null,null,null,null,null,null,null,null,null,null,null,null,null,null,null,1,null,2,1]
[1,{"$f":"IF(I139=\"BENJAMIN\", 1,0)","v":0},{"$f":"IF(I139=\"ALEVIN\", 1,0)","v":0},{"$f":"IF(I139=\"INFANTIL\", 1,0)","v":0},{"$f":"IF(I139=\"CADETE\", 1,0)","v":1},{"$f":"IF(I139=\"JUVENIL\", 1,0)","v":0},{"$f":"IF(I139=\"SENIOR\", 1,0)","v":0},{"$f":"IF(I139=\"VETERANO\", 1,0)","v":0},"CADETE","F","MONTANER ALFARO","SOFÍA","SOFÍA MONTANER ALFARO","73514252L","2010-04-29",2010,15,4,15,"2025-01-03",136,"CENTRO NATACION HELIOS",1,null,null,null,null,null,null,null,null,null,null,null,null,null,null,null,null,null,null,1,1,null,null,null,null,null,null,null,null,null,null,null,null,null,null,null,null,null,null,null,null,1,1,2,2]
[0,{"$f":"IF(I140=\"BENJAMIN\", 1,0)","v":0},{"$f":"IF(I140=\"ALEVIN\", 1,0)","v":0},{"$f":"IF(I140=\"INFANTIL\", 1,0)","v":0},{"$f":"IF(I140=\"CADETE\", 1,0)","v":0},{"$f":"IF(I140=\"JUVENIL\", 1,0)","v":0},{"$f":"IF(I140=\"SENIOR\", 1,0)","v":0},1,"VETERANO","M","MONTANER MARTÍN","RAFAEL","RAFAEL MONTANER MARTÍN","17750003Y","1977-11-25",1977,48,11,48,"2025-01-03",137,"CENTRO NATACION HELIOS",1,null,null,null,null,null,null,null,null,null,null,null,null,null,null,null,null,null,null,null,null,null,null,null,null,null,null,null,null,null,null,null,null,null,null,null,null,null,null,null,null,null,null,0,0]
[0,0,0,0,0,0,0,1,"VETERANO","M","PEIRÓ MESA","JORGE","JORGE PEIRÓ MESA","29117077C","1974-07-23",1974,51,7,51,"2025-01-03",138,"CENTRO NATACION HELIOS",1,null,null,null,null,null,null,null,null,null,null,null,null,null,null,null,null,null,null,1,0,null,null,null,null,null,null,null,null,null,null,null,null,null,null,null,null,null,null,null,null,null,null,1,0]
[1,0,0,0,0,0,0,1,"VETERANO","F","PEÑA HERRERO","MARÍA PILAR","MARÍA PILAR PEÑA HERRERO","25450832K","1970-09-30",1970,55,9,55,"2025-01-03",139,"CENTRO NATACION HELIOS",1,null,null,null,null,null,null,null,null,null,null,null,null,null,null,null,null,null,null,1,1,null,null,null,null,null,null,null,null,null,null,null,null,null,null,null,null,null,null,null,null,1,1,2,2]
[0,0,0,0,0,0,0,1,"VETERANO","M","PÉREZ RODRÍGUEZ","IVÁN","IVÁN PÉREZ RODRÍGUEZ","76582508Y","1992-03-11",1992,33,3,33,"2025-01-03",140,"CENTRO NATACION HELIOS",1,null,null,null,null,null,null,null,null,null,null,null,null,null,null,null,null,null,null,null,null,null,null,null,null,null,null,null,null,null,null,null,null,null,null,null,null,null,null,null,null,null,null,0,0]
[0,0,0,0,0,0,0,1,"VETERANO","M","PÉREZ VICENTE","MIGUEL ÁNGEL","MIGUEL ÁNGEL PÉREZ VICENTE","25159166H","1971-03-26",1971,54,3,54,"2025-01-03",141,"CENTRO NATACION HELIOS",1,null,null,null,null,null,null,null,null,null,null,null,null,null,null,null,null,null,null,null,null,null,null,null,null,null,null,null,null,null,null,null,null,null,null,null,null,null,null,null,null,null,null,0,0]
[0,0,0,0,0,0,0,1,"VETERANO","M","PRADAS QUERO","GREGORIO","GREGORIO PRADAS QUERO","25483694Q","1982-04-05",1982,43,4,43,"2025-01-03",142,"CENTRO NATACION HELIOS",1,null,null,null,null,null,null,null,null,null,null,null,null,null,null,null,null,null,null,1,1,null,null,null,null,null,null,null,null,null,null,null,null,null,null,null,null,null,null,null,null,1,1,2,2]
[1,{"$f":"IF(I146=\"BENJAMIN\", 1,0)","v":0},{"$f":"IF(I146=\"ALEVIN\", 1,0)","v":1},{"$f":"IF(I146=\"INFANTIL\", 1,0)","v":0},{"$f":"IF(I146=\"CADETE\", 1,0)","v":0},{"$f":"IF(I146=\"JUVENIL\", 1,0)","v":0},{"$f":"IF(I146=\"SENIOR\", 1,0)","v":0},{"$f":"IF(I146=\"VETERANO\", 1,0)","v":0},"ALEVIN","F","RELANCIO PASTOR","ADELA","ADELA RELANCIO PASTOR","27352054V","2014-08-05",2014,11,8,11,"2025-01-03",143,"CENTRO NATACION HELIOS",1,null,null,null,1,1,1,1,1,null,null,null,null,null,null,null,null,null,null,1,1,null,null,null,null,null,null,null,null,null,null,null,null,null,null,null,null,null,null,null,null,1,1,2,2]
[1,{"$f":"IF(I147=\"BENJAMIN\", 1,0)","v":1},{"$f":"IF(I147=\"ALEVIN\", 1,0)","v":0},{"$f":"IF(I147=\"INFANTIL\", 1,0)","v":0},{"$f":"IF(I147=\"CADETE\", 1,0)","v":0},{"$f":"IF(I147=\"JUVENIL\", 1,0)","v":0},{"$f":"IF(I147=\"SENIOR\", 1,0)","v":0},{"$f":"IF(I147=\"VETERANO\", 1,0)","v":0},"BENJAMIN","F","RELANCIO PASTOR","ALMA","ALMA RELANCIO PASTOR","27352053Q","2015-12-24",2015,10,12,10,"2025-01-03",144,"CENTRO NATACION HELIOS",1,null,null,null,1,1,1,1,1,null,null,null,null,null,null,null,null,null,null,1,1,null,null,null,null,null,null,null,null,null,null,null,null,null,null,null,null,null,null,null,null,1,1,2,2]
[1,1,0,0,0,0,0,0,"BENJAMIN","F","RELANCIO PASTOR","ÁNGELA","ÁNGELA RELANCIO PASTOR","27352052S","2015-12-24",2015,10,12,10,"2025-01-03",145,"CENTRO NATACION HELIOS",1,null,null,null,1,1,1,1,1,null,null,null,null,null,null,null,null,null,null,1,1,null,null,null,null,null,null,null,null,null,null,null,null,null,null,null,null,null,null,null,null,null,null,1,1]
[0,0,0,0,1,0,0,0,"CADETE","M","REMACHA PUSCO","JAVIER","JAVIER REMACHA PUSCO","30334826B","2010-02-18",2010,15,2,15,"2025-01-03",146,"CENTRO NATACION HELIOS",1,null,null,null,null,null,null,null,null,null,null,null,null,null,null,null,null,null,null,1,1,null,null,null,null,null,null,null,null,null,null,null,null,null,null,null,null,null,null,null,null,1,1,2,2]
[1,0,0,0,0,0,1,0,"SENIOR","F","REMACHA PUSCO","KARLA","KARLA REMACHA PUSCO","73410901F","2006-03-13",2006,19,3,19,"2025-01-03",147,"CENTRO NATACION HELIOS",1,null,null,null,null,null,null,null,null,null,null,null,null,null,null,null,null,null,null,null,null,null,null,null,null,null,null,null,null,null,null,null,null,null,null,null,null,null,null,null,null,1,1,1,1]
[1,0,0,0,0,0,1,0,"SENIOR","F","ROMEO VICENTE","MARÍA","MARÍA ROMEO VICENTE","26280390S","2006-07-07",2006,19,7,19,"2025-01-03",148,"CENTRO NATACION HELIOS",1,null,null,null,null,null,null,null,null,null,null,null,null,null,null,null,null,null,null,1,1,null,null,null,null,null,null,null,null,null,null,null,null,null,null,null,null,null,null,null,null,1,1,2,2,null,1]
[0,1,0,0,0,0,0,0,"BENJAMIN","M","ROYO LAVILLA","ÁNGEL","ÁNGEL ROYO LAVILLA","73622993Q","2016-12-21",2016,9,12,9,"2025-01-03",149,"CENTRO NATACION HELIOS",1,null,null,null,null,null,null,null,null,null,null,null,null,null,null,null,null,null,null,1,1,null,null,null,null,null,null,null,null,null,null,null,null,null,null,null,null,null,null,null,null,null,null,1,1,null,1]
[1,0,0,0,0,0,0,1,"VETERANO","F","SÁEZ LARREA","RUTH","RUTH SÁEZ LARREA","16616371K","1994-09-26",1994,31,9,31,"2025-01-03",150,"CENTRO NATACION HELIOS",1,null,null,null,null,null,null,null,null,null,null,null,null,null,null,null,null,null,null,null,null,null,null,null,null,null,null,null,null,null,null,null,null,null,null,null,null,null,null,null,null,null,null,0,0,null,1]
[0,0,0,0,0,0,0,1,"VETERANO","M","SALAS IBÁÑEZ","JUAN JOSÉ","JUAN JOSÉ SALAS IBÁÑEZ","17178039Y","1950-03-05",1950,75,3,75,"2025-01-03",151,"CENTRO NATACION HELIOS",1,null,null,null,null,null,null,null,null,null,null,null,null,null,null,null,null,null,null,null,null,null,null,null,null,null,null,null,null,null,null,null,null,null,null,null,null,null,null,null,null,null,null,0,0]
[0,0,0,0,0,0,0,1,"VETERANO","M","TABUENCA COLERA","JOSÉ","JOSÉ TABUENCA COLERA","17712127B","1962-01-20",1962,63,1,63,"2025-01-03",152,"CENTRO NATACION HELIOS",1,null,null,null,null,null,null,null,null,null,null,null,null,null,null,null,null,null,null,1,1,null,null,null,null,null,null,null,null,null,null,null,null,null,null,null,null,null,null,null,null,1,1,2,2]
[1,0,0,0,0,1,0,0,"JUVENIL","F","TOVAR GODOY","ISABEL","ISABEL TOVAR GODOY","73164274D","2008-05-20",2008,17,5,17,"2025-01-03",153,"CENTRO NATACION HELIOS",1,null,null,null,null,null,null,null,null,null,null,null,null,null,null,null,null,null,null,1,1,null,null,null,null,null,null,null,null,null,null,null,null,null,null,null,null,null,null,null,null,1,1,2,2]
[0,{"$f":"IF(I157=\"BENJAMIN\", 1,0)","v":0},{"$f":"IF(I157=\"ALEVIN\", 1,0)","v":0},{"$f":"IF(I157=\"INFANTIL\", 1,0)","v":0},{"$f":"IF(I157=\"CADETE\", 1,0)","v":1},{"$f":"IF(I157=\"JUVENIL\", 1,0)","v":0},{"$f":"IF(I157=\"SENIOR\", 1,0)","v":0},{"$f":"IF(I157=\"VETERANO\", 1,0)","v":0},"CADETE","M","TOVAR GODOY","JUAN","JUAN TOVAR GODOY","73164131G","2010-07-08",2010,15,7,15,"2025-01-03",154,"CENTRO NATACION HELIOS",1,null,null,null,null,null,null,null,null,null,null,null,null,null,null,null,null,null,null,null,null,null,null,null,null,null,null,null,null,null,null,null,null,null,null,null,null,null,null,null,null,null,null,0,0]
[0,{"$f":"IF(I158=\"BENJAMIN\", 1,0)","v":0},{"$f":"IF(I158=\"ALEVIN\", 1,0)","v":0},{"$f":"IF(I158=\"INFANTIL\", 1,0)","v":0},{"$f":"IF(I158=\"CADETE\", 1,0)","v":1},{"$f":"IF(I158=\"JUVENIL\", 1,0)","v":0},{"$f":"IF(I158=\"SENIOR\", 1,0)","v":0},{"$f":"IF(I158=\"VETERANO\", 1,0)","v":0},"CADETE","M","VILLORO ANGLÉS","GERMÁN","GERMÁN VILLORO ANGLÉS","73167267N","2010-02-18",2010,15,2,15,"2025-01-03",155,"CENTRO NATACION HELIOS",1,null,null,null,null,null,null,null,null,null,null,null,null,null,null,null,null,null,null,1,1,null,null,null,null,null,null,null,null,null,null,null,null,null,null,null,null,null,null,null,null,1,1,2,2]
[0,0,0,0,0,0,0,1,"VETERANO","M","VILLORO GRASKE","ANTONIO MIGUEL","ANTONIO MIGUEL VILLORO GRASKE","05282461M","1970-10-15",1970,55,10,55,"2025-01-03",156,"CENTRO NATACION HELIOS",1,null,null,null,null,null,null,null,null,null,null,null,null,null,null,null,null,null,null,null,null,null,null,null,null,null,null,null,null,null,null,null,null,null,null,null,null,null,null,null,null,1,1,1,1]
[1,0,0,0,0,1,0,0,"JUVENIL","F","YÁÑEZ MARTÍNEZ","ALICIA","ALICIA YÁÑEZ MARTÍNEZ","26281986R","2008-07-03",2008,17,7,17,"2025-01-03",157,"CENTRO NATACION HELIOS",1,null,null,null,null,null,null,null,null,null,null,null,null,null,null,null,null,null,null,1,1,null,null,null,null,null,null,null,null,null,null,null,null,null,null,null,null,null,null,null,null,null,null,1,1]
[0,0,0,0,0,0,1,0,"SENIOR","M","ZAPATA LARROY","ÍÑIGO MIGUEL","ÍÑIGO MIGUEL ZAPATA LARROY","17769865L","2004-01-09",2004,21,1,21,"2025-01-03",158,"CENTRO NATACION HELIOS",1,null,null,null,null,null,null,null,null,null,null,null,null,null,null,null,null,null,null,null,null,null,null,null,null,null,null,null,null,null,null,null,null,null,null,null,null,null,null,null,null,null,null,0,0]
[0,0,0,0,0,1,0,0,"JUVENIL","M","MÁRQUEZ GUARDIOLA","AARÓN","AARÓN MÁRQUEZ GUARDIOLA","20561541R","2007-01-08",2007,18,1,18,"2025-01-15",159,"CAPRI MEQUINENZA",1,null,null,null,1,1,1,1,1,null,null,null,null,null,null,null,null,null,null,1,1,null,null,null,null,null,null,null,null,null,null,null,null,null,null,null,null,null,null,null,null,1,1,2,2]
[1,0,0,0,1,0,0,0,"CADETE","F","GODIA NICOLAU","ERIKA","ERIKA GODIA NICOLAU","21747570N","2009-11-10",2009,16,11,16,"2025-01-15",160,"CAPRI MEQUINENZA",1,null,null,null,null,null,null,null,null,null,null,null,null,null,null,null,null,null,null,1,1,null,null,null,null,null,null,null,null,null,null,null,null,null,null,null,null,null,null,null,null,1,1,2,2]
[0,0,0,0,0,1,0,0,"JUVENIL","M","GODIA SANCHO","IVÁN","IVÁN GODIA SANCHO","73108472M","2007-10-26",2007,18,10,18,"2025-01-15",161,"CAPRI MEQUINENZA",1,null,null,null,1,1,1,1,1,null,null,null,null,null,null,null,null,null,null,1,0,null,null,null,null,null,null,null,null,null,null,null,null,null,null,null,null,null,null,null,null,1,1,2,1]
[1,1,0,0,0,0,0,0,"BENJAMIN","F","GARCIA SERRANO","NOA ","NOA  GARCIA SERRANO","26607062H","2016-12-10",2016,9,12,9,"2025-01-15",162,"CAPRI MEQUINENZA",1,null,null,null,null,null,null,null,null,null,null,null,null,null,null,null,null,null,null,0,1,null,null,null,null,null,null,null,null,null,null,null,null,null,null,null,null,null,null,null,null,null,null,0,1]
[1,0,0,0,1,0,0,0,"CADETE","F","SERVETO ORDUÑA","SOFÍA","SOFÍA SERVETO ORDUÑA","09825427B","2009-10-27",2009,16,10,16,"2025-01-15",163,"CAPRI MEQUINENZA",1,null,null,null,1,1,1,1,1,null,null,null,null,null,null,null,null,null,null,1,1,null,null,null,null,null,null,null,null,null,null,null,null,null,null,null,null,null,null,null,null,null,null,1,1]
[0,0,0,0,0,1,0,0,"JUVENIL","M","DAMIÁN","TIBERIU GABRIEL","TIBERIU GABRIEL DAMIÁN","Y0919396P","2007-11-12",2007,18,11,18,"2025-01-15",164,"CAPRI MEQUINENZA",1,null,null,null,1,1,1,1,1,null,null,null,null,null,null,null,null,null,null,null,null,null,null,null,null,null,null,null,null,null,null,null,null,null,null,null,null,null,null,null,null,null,null,0,0]
[1,0,0,0,0,0,1,0,"SENIOR","F","TEIRA ARBIOL","CARLA MARÍA","CARLA MARÍA TEIRA ARBIOL","47699950C","1997-05-15",1997,28,5,28,"2025-01-15",165,"CAPRI MEQUINENZA",1,null,null,null,1,0,1,1,1,null,null,null,null,null,null,null,null,null,null,null,null,null,null,null,null,null,null,null,null,null,null,null,null,null,null,null,null,null,null,null,null,null,null,0,0]
[1,0,0,0,0,0,1,0,"SENIOR","F","BERNAL LACRUZ","HELENA","HELENA BERNAL LACRUZ","09825186T","2004-07-06",2004,21,7,21,"2025-01-15",166,"CAPRI MEQUINENZA",1,null,null,null,1,1,1,1,1,null,null,null,null,null,null,null,null,null,null,null,null,null,null,null,null,null,null,null,null,null,null,null,null,null,null,null,null,null,null,null,null,null,null,0,0]
[0,0,0,0,0,0,0,1,"VETERANO","M","LLOP MONTULL","JESÚS MANUEL","JESÚS MANUEL LLOP MONTULL","73151005B","1958-01-30",1958,67,1,67,"2025-01-15",167,"CAPRI MEQUINENZA",1,null,null,null,1,1,1,1,1,null,null,null,null,null,null,null,null,null,null,1,0,null,null,null,null,null,null,null,null,null,null,null,null,null,null,null,null,null,null,null,null,null,null,1,0]
[0,{"$f":"IF(I171=\"BENJAMIN\", 1,0)","v":0},{"$f":"IF(I171=\"ALEVIN\", 1,0)","v":0},{"$f":"IF(I171=\"INFANTIL\", 1,0)","v":0},{"$f":"IF(I171=\"CADETE\", 1,0)","v":0},{"$f":"IF(I171=\"JUVENIL\", 1,0)","v":0},{"$f":"IF(I171=\"SENIOR\", 1,0)","v":0},{"$f":"IF(I171=\"VETERANO\", 1,0)","v":1},"VETERANO","M","ITHARTE","MARCELO","MARCELO ITHARTE","Y8736836R","1968-05-15",1968,57,5,57,"2025-01-15",168,"CAPRI MEQUINENZA",1,null,null,null,1,1,1,1,1,null,null,null,null,null,null,null,null,null,null,null,null,null,null,null,null,null,null,null,null,null,null,null,null,null,null,null,null,null,null,null,null,null,null,0,0]
[{"$f":"IF(J172=\"F\", 1,0)","v":1},{"$f":"IF(I172=\"BENJAMIN\", 1,0)","v":0},{"$f":"IF(I172=\"ALEVIN\", 1,0)","v":0},{"$f":"IF(I172=\"INFANTIL\", 1,0)","v":0},{"$f":"IF(I172=\"CADETE\", 1,0)","v":0},{"$f":"IF(I172=\"JUVENIL\", 1,0)","v":0},{"$f":"IF(I172=\"SENIOR\", 1,0)","v":1},0,"SENIOR","F","GODIA PI","MARÍA PILAR","MARÍA PILAR GODIA PI","73092011N","1996-01-14",1996,29,1,29,"2025-01-15",169,"CAPRI MEQUINENZA",1,null,null,null,1,1,1,1,1,null,null,null,null,null,null,null,null,null,null,1,0,null,null,null,null,null,null,null,null,null,null,null,null,null,null,null,null,null,null,null,null,null,null,1,0]
[0,0,0,0,0,0,0,1,"VETERANO","M","FERNÁNDEZ GIL","OLIVER","OLIVER FERNÁNDEZ GIL","73199551G","1977-03-01",1977,48,3,48,"2025-01-15",170,"CAPRI MEQUINENZA",1,null,null,null,1,1,1,1,1,null,null,null,null,null,null,null,null,null,null,null,null,null,null,null,null,null,null,null,null,null,null,null,null,null,null,null,null,null,null,null,null,null,null,0,0]
[1,0,0,0,0,0,0,1,"VETERANO","F","LLOP RIAU","ROSA MARÍA","ROSA MARÍA LLOP RIAU","73155604X","1968-01-27",1968,57,1,57,"2025-01-15",171,"CAPRI MEQUINENZA",1,null,null,null,1,1,1,1,1,null,null,null,null,null,null,null,null,null,null,null,null,null,null,null,null,null,null,null,null,null,null,null,null,null,null,null,null,null,null,null,null,null,null,0,0]
[1,0,0,0,0,0,1,0,"SENIOR","F","SERVETO ORDUÑA","SARA","SARA SERVETO ORDUÑA","09825426X","2005-01-25",2005,20,1,20,"2025-01-15",172,"CAPRI MEQUINENZA",1,null,null,null,1,null,null,null,null,null,null,null,null,null,null,null,null,null,null,null,null,null,null,null,null,null,null,null,null,null,null,null,null,null,null,null,null,null,null,null,null,null,null,0,0]
[1,0,0,0,0,0,0,1,"VETERANO","F","SERVETO PALOMAR","PEDRO JOSÉ","PEDRO JOSÉ SERVETO PALOMAR","73194997G","1970-04-02",1970,55,4,55,"2025-01-15",173,"CAPRI MEQUINENZA",null,null,1,null,1,1,1,1,1,null,null,null,null,null,null,null,null,null,null,null,null,null,null,null,null,null,null,null,null,null,null,null,null,null,null,null,null,null,null,null,null,null,null,0,0]
[1,0,0,0,1,0,0,0,"CADETE","F","ALCÁNTARA BUATAS","JIMENA",{"$f":"L177&\" \"& K177","v":"JIMENA ALCÁNTARA BUATAS"},"73623382C","2009-11-20",{"$f":"YEAR(O177)","v":2009},{"$f":"$Y$1-P177","v":16},{"$f":"MONTH(O177)","v":11},16,"2025-01-03",174,"CENTRO NATACION HELIOS",1,null,null,null,null,null,null,null,null,null,null,null,null,null,null,null,null,null,null,null,null,null,null,null,null,null,null,null,null,null,null,null,null,null,null,null,null,null,null,null,null,null,null,{"$f":"AJ177+AL177+AN177+AP177+AR177+AT177+AV177+AX177+AZ177+BB177+BD177+BF177+BH177+BJ177+BL177","v":0},0]
[0,0,0,0,0,0,0,1,"VETERANO","M","ARANDA MARTÍNEZ","PEDRO BENITO","PEDRO BENITO ARANDA MARTÍNEZ","17727417Y","1970-02-19",1970,55,2,55,"2025-01-03",175,"CENTRO NATACION HELIOS",1,null,null,null,null,null,null,null,null,null,null,null,null,null,null,null,null,null,null,null,null,null,null,null,null,null,null,null,null,null,null,null,null,null,null,null,null,null,null,null,null,1,1,1,1]
[0,0,0,0,0,0,0,1,"VETERANO","M","BIELSA ARTIDIELLO","JOSÉ MANUEL","JOSÉ MANUEL BIELSA ARTIDIELLO","29091165Y","1964-10-14",1964,61,10,61,"2025-01-03",176,"CENTRO NATACION HELIOS",1,null,null,null,null,null,null,null,null,null,null,null,null,null,null,null,null,null,null,null,null,null,null,null,null,null,null,null,null,null,null,null,null,null,null,null,null,null,null,null,null,null,null,0,0,1,1]
[0,0,0,0,0,0,0,1,"VETERANO","M","GARCÉS BALLERTE","ELOY","ELOY GARCÉS BALLERTE","73004993A","1991-04-09",1991,34,4,34,"2025-01-03",177,"CENTRO NATACION HELIOS",1,null,null,null,null,null,null,null,null,null,null,null,null,null,null,null,null,null,null,null,null,null,null,null,null,null,null,null,null,null,null,null,null,null,null,null,null,null,null,null,null,null,null,0,0,1,1]
[1,0,0,0,0,1,0,0,"JUVENIL","F","HONENSHLT","MARGARET","MARGARET HONENSHLT","A44268501","2008-05-16",2008,17,5,17,"2025-01-03",178,"CENTRO NATACION HELIOS",1,null,null,null,null,null,null,null,null,null,null,null,null,null,null,null,null,null,null,1,0,null,null,null,null,null,null,null,null,null,null,null,null,null,null,null,null,null,null,null,null,null,null,1,0]
[0,{"$f":"IF(I182=\"BENJAMIN\", 1,0)","v":1},{"$f":"IF(I182=\"ALEVIN\", 1,0)","v":0},{"$f":"IF(I182=\"INFANTIL\", 1,0)","v":0},{"$f":"IF(I182=\"CADETE\", 1,0)","v":0},{"$f":"IF(I182=\"JUVENIL\", 1,0)","v":0},{"$f":"IF(I182=\"SENIOR\", 1,0)","v":0},{"$f":"IF(I182=\"VETERANO\", 1,0)","v":0},"BENJAMIN","M","LENNIKOV IGLESIAS","VÍCTOR","VÍCTOR LENNIKOV IGLESIAS","73235970Z","2015-05-17",2015,10,5,10,"2025-01-03",179,"CENTRO NATACION HELIOS",1,null,null,null,null,null,null,null,null,null,null,null,null,null,null,null,null,null,null,1,1,null,null,null,null,null,null,null,null,null,null,null,null,null,null,null,null,null,null,null,null,1,1,2,2]
[1,{"$f":"IF(I183=\"BENJAMIN\", 1,0)","v":0},{"$f":"IF(I183=\"ALEVIN\", 1,0)","v":0},{"$f":"IF(I183=\"INFANTIL\", 1,0)","v":0},{"$f":"IF(I183=\"CADETE\", 1,0)","v":0},{"$f":"IF(I183=\"JUVENIL\", 1,0)","v":0},{"$f":"IF(I183=\"SENIOR\", 1,0)","v":0},1,"VETERANO","F","MELO HURTADO","SYLVIA MARÍA","SYLVIA MARÍA MELO HURTADO","Y5813761L","1989-10-04",1989,36,10,36,"2025-01-03",180,"CENTRO NATACION HELIOS",1,null,null,null,null,null,null,null,null,null,null,null,null,null,null,null,null,null,null,null,null,null,null,null,null,null,null,null,null,null,null,null,null,null,null,null,null,null,null,null,null,1,1,1,1]
[0,0,0,0,0,0,0,1,"VETERANO","M","NAVARRO SANGüESA","PEDRO MARÍA","PEDRO MARÍA NAVARRO SANGüESA","73001744C","1987-11-06",1987,38,11,38,"2025-01-03",181,"CENTRO NATACION HELIOS",1,null,null,null,null,null,null,null,null,null,null,null,null,null,null,null,null,null,null,1,1,null,null,null,null,null,null,null,null,null,null,null,null,null,null,null,null,null,null,null,null,1,1,2,2]
[0,0,0,0,0,0,1,0,"SENIOR","M","MUNIESA AGUAS","JAVIER","JAVIER MUNIESA AGUAS","73027171D","2001-03-08",2001,24,3,24,"2025-01-03",182,"CENTRO NATACION HELIOS",1,null,null,null,1,1,1,1,1,null,null,null,null,null,null,null,null,null,null,null,null,null,null,null,null,null,null,null,null,null,null,null,null,null,null,null,null,null,null,null,null,null,null,0,0]
[0,0,0,0,0,0,0,1,"VETERANO","M","SEBASTIÁN BELANCHE","JOSÉ GABRIEL","JOSÉ GABRIEL SEBASTIÁN BELANCHE","17160587B","1963-04-30",1963,62,4,62,"2025-01-03",183,"CENTRO NATACION HELIOS",1,null,null,null,null,null,null,null,null,null,null,null,null,null,null,null,null,null,null,null,null,null,null,null,null,null,null,null,null,null,null,null,null,null,null,null,null,null,null,null,null,null,null,0,0]
[0,{"$f":"IF(I187=\"BENJAMIN\", 1,0)","v":0},{"$f":"IF(I187=\"ALEVIN\", 1,0)","v":0},{"$f":"IF(I187=\"INFANTIL\", 1,0)","v":0},{"$f":"IF(I187=\"CADETE\", 1,0)","v":0},{"$f":"IF(I187=\"JUVENIL\", 1,0)","v":0},{"$f":"IF(I187=\"SENIOR\", 1,0)","v":0},{"$f":"IF(I187=\"VETERANO\", 1,0)","v":1},"VETERANO","M","PASTOR MONTAÑO","MARIA ÁNGELES","MARIA ÁNGELES PASTOR MONTAÑO","29131323V","1982-01-04",1982,43,1,43,"2025-01-03",184,"CENTRO NATACION HELIOS",1,null,null,null,1,1,1,1,1,null,null,null,null,null,null,null,null,null,null,1,1,null,null,null,null,null,null,null,null,null,null,null,null,null,null,null,null,null,null,null,null,1,1,2,2]
[0,{"$f":"IF(I188=\"BENJAMIN\", 1,0)","v":0},{"$f":"IF(I188=\"ALEVIN\", 1,0)","v":0},{"$f":"IF(I188=\"INFANTIL\", 1,0)","v":0},{"$f":"IF(I188=\"CADETE\", 1,0)","v":1},{"$f":"IF(I188=\"JUVENIL\", 1,0)","v":0},{"$f":"IF(I188=\"SENIOR\", 1,0)","v":0},{"$f":"IF(I188=\"VETERANO\", 1,0)","v":0},"CADETE","M","SINUSIA LAVIL","DAVID","DAVID SINUSIA LAVIL","73271540A","2010-12-31",2010,15,12,14,"2025-01-03",185,"CENTRO NATACION HELIOS",1,null,null,null,null,null,null,null,null,null,null,null,null,null,null,null,null,null,null,null,null,null,null,null,null,null,null,null,null,null,null,null,null,null,null,null,null,null,null,null,null,null,null,0,0]
[1,0,0,0,0,1,0,0,"JUVENIL","F","DIEZ GARCÍA","SANDRA","SANDRA DIEZ GARCÍA","25210786A","2008-07-11",2008,17,7,17,"2025-01-03",186,"CENTRO NATACION HELIOS",1,null,null,null,null,null,null,null,null,null,null,null,null,null,null,null,null,null,null,1,1,null,null,null,null,null,null,null,null,null,null,null,null,null,null,null,null,null,null,null,null,1,1,2,2]
[1,0,0,0,0,0,0,1,"VETERANO","F","SANCHO BUSTÍN","NAOMI","NAOMI SANCHO BUSTÍN","73028933T","1994-08-05",1994,31,8,31,"2025-01-03",187,"OS NABATERS D.F.",1,1,null,null,1,0,0,0,0,null,null,null,null,null,null,null,null,null,null,null,null,null,null,null,null,null,null,null,null,null,null,null,null,null,null,null,null,null,null,null,null,null,null,0,0]
[0,0,0,0,0,0,0,1,"VETERANO","M","SALILLAS MARTÍNEZ","RICARDO","RICARDO SALILLAS MARTÍNEZ","25204984C","1994-12-16",1994,31,12,31,"2025-01-03",188,"OS NABATERS D.F.",1,null,null,null,1,1,1,1,1,null,null,null,null,null,null,null,null,null,null,null,null,null,null,null,null,null,null,null,null,null,null,null,null,null,null,null,null,null,null,null,null,null,null,0,0]
[0,0,0,0,0,0,0,1,"VETERANO","M","SEBASTIÁN BUSTÍN","OMAR","OMAR SEBASTIÁN BUSTÍN","73025719Y","1994-05-11",1994,31,5,31,"2025-01-03",189,"OS NABATERS D.F.",1,null,null,null,1,1,1,1,1,null,null,null,null,null,null,null,null,null,null,null,null,null,null,null,null,null,null,null,null,null,null,null,null,null,null,null,null,null,null,null,null,null,null,0,0]
[1,0,0,0,0,0,1,0,"SENIOR","F","SANCHO BUSTÍN","ALODIA","ALODIA SANCHO BUSTÍN","73028934R","1997-08-27",1997,28,8,28,"2025-01-03",190,"OS NABATERS D.F.",1,null,null,null,1,1,1,1,1,null,null,null,null,null,null,null,null,null,null,null,null,null,null,null,null,null,null,null,null,null,null,null,null,null,null,null,null,null,null,null,null,null,null,0,0]
[0,0,0,0,0,0,0,1,"VETERANO","M","MELERO PASCUAL","LUIS JAVIER","LUIS JAVIER MELERO PASCUAL","29102894M","1969-09-17",1969,56,9,56,"2025-01-03",191,"OS NABATERS D.F.",1,null,null,null,1,0,1,1,1,null,null,null,null,null,null,null,null,null,null,null,null,null,null,null,null,null,null,null,null,null,null,null,null,null,null,null,null,null,null,null,null,null,null,0,0]
[0,0,0,0,0,0,0,1,"VETERANO","M","SANCHO NAVARRO","ANTONIO ANSELMO","ANTONIO ANSELMO SANCHO NAVARRO","17206376F","1961-04-21",1961,64,4,64,"2025-01-03",192,"OS NABATERS D.F.",1,1,null,null,1,0,0,0,0,null,null,null,null,null,null,null,null,null,null,null,null,null,null,null,null,null,null,null,null,null,null,null,null,null,null,null,null,null,null,null,null,null,null,0,0]
[0,0,0,0,0,0,0,1,"VETERANO","M","EMBARBA LABORDA","JOSÉ MARÍA","JOSÉ MARÍA EMBARBA LABORDA","72963666F","1961-04-15",1961,64,4,{"$f":"DATEDIF(O196,TODAY(),\"Y\")","v":64},"2025-01-03",193,"OS NABATERS D.F.",1,null,null,null,1,0,1,1,1,null,null,null,null,null,null,null,null,null,null,null,null,null,null,null,null,null,null,null,null,null,null,null,null,null,null,null,null,null,null,null,null,null,null,0,0]
[0,0,0,0,0,0,0,1,"VETERANO","M","BELLED LACASA","LUIS CARLOS","LUIS CARLOS BELLED LACASA","25427822B","1964-06-09",1964,61,6,61,"2025-01-03",194,"OS NABATERS D.F.",1,1,null,null,1,1,1,1,1,null,null,null,null,null,null,null,null,null,null,null,null,null,null,null,null,null,null,null,null,null,null,null,null,null,null,null,null,null,null,null,null,null,null,0,0]
[0,0,0,0,0,0,0,1,"VETERANO","M","AGUILERA ANDRÉS","ÁNGEL","ÁNGEL AGUILERA ANDRÉS","17178108Y","1949-11-07",1949,76,11,76,"2025-01-03",195,"OS NABATERS D.F.",1,null,null,null,1,0,1,1,1,null,null,null,null,null,null,null,null,null,null,null,null,null,null,null,null,null,null,null,null,null,null,null,null,null,null,null,null,null,null,null,null,null,null,0,0]
[0,0,0,0,0,0,0,1,"VETERANO","M","PLOU ARTAL","PEDRO DANIEL","PEDRO DANIEL PLOU ARTAL","17715212Z","1962-06-29",1962,63,6,63,"2025-01-03",196,"OS NABATERS D.F.",1,null,null,null,1,0,0,0,0,null,null,null,null,null,null,null,null,null,null,null,null,null,null,null,null,null,null,null,null,null,null,null,null,null,null,null,null,null,null,null,null,null,null,0,0]
[0,0,0,0,0,0,0,1,"VETERANO","M","MAGDALENA ABAD","JOSÉ IGNACIO","JOSÉ IGNACIO MAGDALENA ABAD","17442414L","1968-08-09",1968,57,8,57,"2025-01-03",197,"OS NABATERS D.F.",1,null,null,null,1,0,0,0,0,null,null,null,null,null,null,null,null,null,null,null,null,null,null,null,null,null,null,null,null,null,null,null,null,null,null,null,null,null,null,null,null,null,null,0,0]
[0,{"$f":"IF(I201=\"BENJAMIN\", 1,0)","v":0},{"$f":"IF(I201=\"ALEVIN\", 1,0)","v":0},{"$f":"IF(I201=\"INFANTIL\", 1,0)","v":0},{"$f":"IF(I201=\"CADETE\", 1,0)","v":0},{"$f":"IF(I201=\"JUVENIL\", 1,0)","v":0},{"$f":"IF(I201=\"SENIOR\", 1,0)","v":0},{"$f":"IF(I201=\"VETERANO\", 1,0)","v":1},"VETERANO","M","NAVARRETE SÁNCHEZ","ISCICIO","ISCICIO NAVARRETE SÁNCHEZ","25140545G","1965-06-19",1965,60,6,60,"2025-01-03",198,"OS NABATERS D.F.",1,null,null,null,1,0,1,1,1,null,null,null,null,null,null,null,null,null,null,null,null,null,null,null,null,null,null,null,null,null,null,null,null,null,null,null,null,null,null,null,null,null,null,0,0]
[0,{"$f":"IF(I202=\"BENJAMIN\", 1,0)","v":0},{"$f":"IF(I202=\"ALEVIN\", 1,0)","v":0},{"$f":"IF(I202=\"INFANTIL\", 1,0)","v":0},{"$f":"IF(I202=\"CADETE\", 1,0)","v":0},{"$f":"IF(I202=\"JUVENIL\", 1,0)","v":0},{"$f":"IF(I202=\"SENIOR\", 1,0)","v":0},1,"VETERANO","M","DEL AMO SANCHO","ALEJANDRO","ALEJANDRO DEL AMO SANCHO","17754550E","1982-02-05",1982,43,2,43,"2025-01-03",199,"OS NABATERS D.F.",1,null,null,null,1,0,0,0,0,null,null,null,null,null,null,null,null,null,null,null,null,null,null,null,null,null,null,null,null,null,null,null,null,null,null,null,null,null,null,null,null,null,null,0,0]
[0,0,0,0,0,1,0,0,"JUVENIL","M","AZNAR SAMPER","ADRIÁN","ADRIÁN AZNAR SAMPER","25356729B","2007-03-09",2007,18,3,18,"2025-01-03",200,"OS NABATERS D.F.",1,null,null,null,1,1,1,1,1,null,null,null,null,null,null,null,null,null,null,1,0,null,null,null,null,null,null,null,null,null,null,null,null,null,null,null,null,null,null,null,null,null,null,1,0]
[1,0,0,0,0,0,0,1,"VETERANO","F","ESTABLÉS SUJÁN","SUSANA","SUSANA ESTABLÉS SUJÁN","72976040F","1980-06-04",1980,45,6,45,"2025-01-03",201,"OS NABATERS D.F.",1,null,null,null,1,1,1,1,1,null,null,null,null,null,null,null,null,null,null,null,null,null,null,null,null,null,null,null,null,null,null,null,null,null,null,null,null,null,null,null,null,null,null,0,0]
[1,0,0,0,0,0,1,0,"SENIOR","F","HERNÁNDEZ ROYO","RAQUEL","RAQUEL HERNÁNDEZ ROYO","26279886V","2000-11-29",2000,25,11,25,"2025-01-03",202,"OS NABATERS D.F.",1,null,null,null,1,1,1,1,1,null,null,null,null,null,null,null,null,null,null,null,null,null,null,null,null,null,null,null,null,null,null,null,null,null,null,null,null,null,null,null,null,null,null,0,0]
[0,0,0,0,0,0,1,0,"SENIOR","M","VILLAR QUINTANA","JESÚS MARÍA","JESÚS MARÍA VILLAR QUINTANA","77138627P","1995-02-03",1995,30,2,30,"2025-01-03",203,"OS NABATERS D.F.",1,null,null,null,1,1,1,1,1,null,null,null,null,null,null,null,null,null,null,null,null,null,null,null,null,null,null,null,null,null,null,null,null,null,null,null,null,null,null,null,null,null,null,0,0]
[0,0,0,0,0,0,0,1,"VETERANO","M","HERNÁNDEZ PASCUAL","JOSÉ LUIS","JOSÉ LUIS HERNÁNDEZ PASCUAL","17220733N","1964-06-30",1964,61,6,61,"2025-01-03",204,"OS NABATERS D.F.",1,null,null,null,1,1,1,1,1,null,null,null,null,null,null,null,null,null,null,null,null,null,null,null,null,null,null,null,null,null,null,null,null,null,null,null,null,null,null,null,null,null,null,0,0]
[0,0,0,0,0,0,0,1,"VETERANO","M","HERNÁNDEZ ARAGÜET","IGNACIO","IGNACIO HERNÁNDEZ ARAGÜET","76924225N","1988-05-27",1988,37,5,37,"2025-01-03",205,"OS NABATERS D.F.",1,null,null,null,1,1,1,1,1,null,null,null,null,null,null,null,null,null,null,null,null,null,null,null,null,null,null,null,null,null,null,null,null,null,null,null,null,null,null,null,null,null,null,0,0]
[0,0,0,0,0,0,0,1,"VETERANO","M","GRACIA AGUSTÍN","JOSÉ ÁNGEL","JOSÉ ÁNGEL GRACIA AGUSTÍN","17154655J","1960-07-12",1960,65,7,65,"2025-01-03",206,"OS NABATERS D.F.",1,null,null,null,1,1,1,1,1,null,null,null,null,null,null,null,null,null,null,null,null,null,null,null,null,null,null,null,null,null,null,null,null,null,null,null,null,null,null,null,null,null,null,0,0]
[1,{"$f":"IF(I210=\"BENJAMIN\", 1,0)","v":0},{"$f":"IF(I210=\"ALEVIN\", 1,0)","v":0},{"$f":"IF(I210=\"INFANTIL\", 1,0)","v":0},{"$f":"IF(I210=\"CADETE\", 1,0)","v":0},{"$f":"IF(I210=\"JUVENIL\", 1,0)","v":1},{"$f":"IF(I210=\"SENIOR\", 1,0)","v":0},{"$f":"IF(I210=\"VETERANO\", 1,0)","v":0},"JUVENIL","F","MARTÍN RANERA","SARA","SARA MARTÍN RANERA","26055855Y","2007-07-21",2007,18,7,18,"2025-01-03",207,"OS NABATERS D.F.",1,null,null,null,1,0,1,1,1,null,null,null,null,null,null,null,null,null,null,null,null,null,null,null,null,null,null,null,null,null,null,null,null,null,null,null,null,null,null,null,null,null,null,0,0]
[0,{"$f":"IF(I211=\"BENJAMIN\", 1,0)","v":0},{"$f":"IF(I211=\"ALEVIN\", 1,0)","v":0},{"$f":"IF(I211=\"INFANTIL\", 1,0)","v":0},{"$f":"IF(I211=\"CADETE\", 1,0)","v":0},{"$f":"IF(I211=\"JUVENIL\", 1,0)","v":1},{"$f":"IF(I211=\"SENIOR\", 1,0)","v":0},{"$f":"IF(I211=\"VETERANO\", 1,0)","v":0},"JUVENIL","M","FAUBELL MACÍA","GERMÁN","GERMÁN FAUBELL MACÍA","25359729K","2007-09-21",2007,18,9,18,"2025-01-03",208,"OS NABATERS D.F.",1,null,null,null,1,1,1,1,1,null,null,null,null,null,null,null,null,null,null,null,null,null,null,null,null,null,null,null,null,null,null,null,null,null,null,null,null,null,null,null,null,null,null,0,0]
[0,0,0,0,0,0,0,1,"VETERANO","M","CAMBERO CENZANO","JOSÉ LUIS","JOSÉ LUIS CAMBERO CENZANO","25444469Y","1969-05-05",1969,56,5,56,"2025-01-03",209,"OS NABATERS D.F.",1,null,null,null,1,1,1,1,1,null,null,null,null,null,null,null,null,null,null,null,null,null,null,null,null,null,null,null,null,null,null,null,null,null,null,null,null,null,null,null,null,null,null,0,0]
[0,0,0,0,0,0,1,0,"SENIOR","M","PONCE USÓN","JORGE","JORGE PONCE USÓN","25207173R","2000-11-17",2000,25,11,25,"2025-01-03",210,"OS NABATERS D.F.",null,null,1,null,1,0,1,1,1,null,null,null,null,null,null,null,null,null,null,1,1,null,null,null,null,null,null,null,null,null,null,null,null,null,null,null,null,null,null,null,null,null,null,1,1]
[0,0,0,0,0,0,1,0,"SENIOR","M","VICENTE MIRANDA","GUILLÉN","GUILLÉN VICENTE MIRANDA","73448811J","2001-06-16",2001,24,6,24,"2025-01-03",211,"OS NABATERS D.F.",1,1,null,null,1,1,1,1,1,null,null,null,null,null,null,null,null,null,null,1,1,null,null,null,null,null,null,null,null,null,null,null,null,null,null,null,null,null,null,null,null,null,null,1,1]
[0,0,0,0,0,0,0,1,"VETERANO","M","BEA GONZÁLEZ","MIGUEL","MIGUEL BEA GONZÁLEZ","17205307L","1966-09-26",1966,59,9,59,"2025-01-03",212,"OS NABATERS D.F.",null,null,1,null,1,1,0,0,0,null,null,null,null,null,null,null,null,null,null,null,null,null,null,null,null,null,null,null,null,null,null,null,null,null,null,null,null,null,null,null,null,1,1,1,1]
[0,1,0,0,0,0,0,0,"BENJAMIN","M","IVZHENKO","VÍCTOR","VÍCTOR IVZHENKO","Y9468475X","2015-02-02",2015,10,2,10,"2025-01-03",213,"OS NABATERS D.F.",1,null,null,null,1,1,1,1,1,null,null,null,null,null,null,null,null,null,null,1,1,null,null,null,null,null,null,null,null,null,null,null,null,null,null,null,null,null,null,null,null,null,null,1,1]
[1,0,0,0,0,0,0,1,"VETERANO","F","GIMÉNEZ HERRERO","MERCEDES","MERCEDES GIMÉNEZ HERRERO","25426937T","1964-12-17",1964,61,12,61,"2025-01-03",214,"OS NABATERS D.F.",1,null,null,null,1,0,1,1,1,null,null,null,null,null,null,null,null,null,null,null,null,null,null,null,null,null,null,null,null,null,null,null,null,null,null,null,null,null,null,null,null,null,null,0,0]
[0,0,0,0,0,0,0,1,"VETERANO","M","OVALLES GUERRA","ABEL RICARDO","ABEL RICARDO OVALLES GUERRA","Y9771137S","1989-10-21",1989,36,10,36,"2025-01-03",215,"OS NABATERS D.F.",1,null,null,null,1,1,1,1,1,null,null,null,null,null,null,null,null,null,null,1,1,null,null,null,null,null,null,null,null,null,null,null,null,null,null,null,null,null,null,null,null,1,1,2,2]
[0,0,0,1,0,0,0,0,"INFANTIL","M","MARCOS GARCÍA","DAVID","DAVID MARCOS GARCÍA","71716733L","2011-11-10",2011,14,11,14,"2025-01-03",216,"OS NABATERS D.F.",1,null,null,null,1,1,1,1,1,null,null,null,null,null,null,null,null,null,null,1,1,null,null,null,null,null,null,null,null,null,null,null,null,null,null,null,null,null,null,null,null,null,null,1,1]
[0,0,0,0,0,0,0,1,"VETERANO","M","NAVARRO CARRETERO","ROBERTO","ROBERTO NAVARRO CARRETERO","25444641V","1969-10-16",1969,56,10,56,"2025-01-03",217,"OS NABATERS D.F.",1,null,null,null,1,1,1,1,1,null,null,null,null,null,null,null,null,null,null,null,null,null,null,null,null,null,null,null,null,null,null,null,null,null,null,null,null,null,null,null,null,null,null,0,0]
[0,0,0,0,1,0,0,0,"CADETE","M","CANO JIMÉNEZ","DARÍO","DARÍO CANO JIMÉNEZ","49968088J","2009-08-05",2009,16,8,16,"2025-01-03",218,"OS NABATERS D.F.",1,null,null,null,1,1,1,1,1,null,null,null,null,null,null,null,null,null,null,1,1,null,null,null,null,null,null,null,null,null,null,null,null,null,null,null,null,null,null,null,null,null,null,1,1]
[0,0,0,1,0,0,0,0,{"$f":"IF((Q222<11),\"BENJAMIN\",IF(OR(Q222=11,Q222=12),\"ALEVIN\",IF(OR(Q222=13,Q222=14),\"INFANTIL\",IF(OR(Q222=15,Q222=16),\"CADETE\",IF(OR(Q222=17,Q222=18),\"JUVENIL\",IF(AND(Q222>18,Q222<31),\"SENIOR\",\"VETERANO\"))))))","v":"INFANTIL"},"M","DÍEZ MOZOTA","CÉSAR","CÉSAR DÍEZ MOZOTA","30336254J","2012-11-04",2012,13,11,13,"2025-01-03",219,"OS NABATERS D.F.",1,null,null,null,1,1,1,1,1,null,null,null,null,null,null,null,null,null,null,1,1,null,null,null,null,null,null,null,null,null,null,null,null,null,null,null,null,null,null,null,null,1,1,2,2]
[0,0,0,0,0,0,0,1,"VETERANO","M","DÍEZ DÍEZ","RAÚL","RAÚL DÍEZ DÍEZ","72965532X","1971-05-25",1971,54,5,54,"2025-01-03",220,"OS NABATERS D.F.",1,null,null,null,1,1,1,1,1,null,null,null,null,null,null,null,null,null,null,1,1,null,null,null,null,null,null,null,null,null,null,null,null,null,null,null,null,null,null,null,null,1,1,2,2]
[0,{"$f":"IF(I224=\"BENJAMIN\", 1,0)","v":0},{"$f":"IF(I224=\"ALEVIN\", 1,0)","v":0},{"$f":"IF(I224=\"INFANTIL\", 1,0)","v":0},{"$f":"IF(I224=\"CADETE\", 1,0)","v":0},{"$f":"IF(I224=\"JUVENIL\", 1,0)","v":0},{"$f":"IF(I224=\"SENIOR\", 1,0)","v":0},{"$f":"IF(I224=\"VETERANO\", 1,0)","v":1},"VETERANO","M","OLMO NADAL","DAVID","DAVID OLMO NADAL","29120065H","1977-02-14",1977,48,2,48,"2025-01-03",221,"OS NABATERS D.F.",1,null,null,null,1,1,1,1,1,null,null,null,null,null,null,null,null,null,null,null,null,null,null,null,null,null,null,null,null,null,null,null,null,null,null,null,null,null,null,null,null,null,null,0,0]
[1,{"$f":"IF(I225=\"BENJAMIN\", 1,0)","v":0},{"$f":"IF(I225=\"ALEVIN\", 1,0)","v":0},{"$f":"IF(I225=\"INFANTIL\", 1,0)","v":0},{"$f":"IF(I225=\"CADETE\", 1,0)","v":0},{"$f":"IF(I225=\"JUVENIL\", 1,0)","v":0},{"$f":"IF(I225=\"SENIOR\", 1,0)","v":1},0,"SENIOR","F","CID RUIZ","ELENA","ELENA CID RUIZ","49636766Y","2002-04-12",2002,23,4,23,"2025-01-03",222,"OS NABATERS D.F.",1,null,null,null,1,1,1,1,1,null,null,null,null,null,null,null,null,null,null,null,null,null,null,null,null,null,null,null,null,null,null,null,null,null,null,null,null,null,null,null,null,null,null,0,0]
[1,0,0,0,0,0,0,1,"VETERANO","F","MATAIX MONTANER","ANDREA","ANDREA MATAIX MONTANER","20453253C","1985-05-09",1985,40,5,40,"2025-01-03",223,"OS NABATERS D.F.",1,null,null,null,1,1,1,1,1,null,null,null,null,null,null,null,null,null,null,1,1,null,null,null,null,null,null,null,null,null,null,null,null,null,null,null,null,null,null,null,null,1,1,2,2]
[1,0,0,0,0,1,0,0,"JUVENIL","F","BAILO GARCÍA","SARA","SARA BAILO GARCÍA","77221560A","2007-11-27",2007,18,11,18,"2025-01-03",224,"OS NABATERS D.F.",1,null,null,null,1,1,1,1,1,null,null,null,null,null,null,null,null,null,null,null,null,null,null,null,null,null,null,null,null,null,null,null,null,null,null,null,null,null,null,null,null,null,null,0,0]
[0,{"$f":"IF(I228=\"BENJAMIN\", 1,0)","v":0},{"$f":"IF(I228=\"ALEVIN\", 1,0)","v":0},{"$f":"IF(I228=\"INFANTIL\", 1,0)","v":0},{"$f":"IF(I228=\"CADETE\", 1,0)","v":0},{"$f":"IF(I228=\"JUVENIL\", 1,0)","v":0},{"$f":"IF(I228=\"SENIOR\", 1,0)","v":0},{"$f":"IF(I228=\"VETERANO\", 1,0)","v":1},"VETERANO","M","ALEGRE TRIS","JUAN","JUAN ALEGRE TRIS","17751647V","1981-10-28",1981,44,10,44,"2025-01-03",225,"OS NABATERS D.F.",1,null,null,null,1,1,1,1,1,null,null,null,null,null,null,null,null,null,null,null,null,null,null,null,null,null,null,null,null,null,null,null,null,null,null,null,null,null,null,null,null,null,null,0,0]
[0,{"$f":"IF(I229=\"BENJAMIN\", 1,0)","v":0},{"$f":"IF(I229=\"ALEVIN\", 1,0)","v":0},{"$f":"IF(I229=\"INFANTIL\", 1,0)","v":0},{"$f":"IF(I229=\"CADETE\", 1,0)","v":0},{"$f":"IF(I229=\"JUVENIL\", 1,0)","v":0},{"$f":"IF(I229=\"SENIOR\", 1,0)","v":0},{"$f":"IF(I229=\"VETERANO\", 1,0)","v":1},"VETERANO","M","MARTÍN ESCUÍN","JOSÉ LUIS","JOSÉ LUIS MARTÍN ESCUÍN","25160888S","1971-10-13",1971,54,10,54,"2025-01-03",226,"OS NABATERS D.F.",1,null,null,null,1,1,1,1,1,null,null,null,null,null,null,null,null,null,null,null,null,null,null,null,null,null,null,null,null,null,null,null,null,null,null,null,null,null,null,null,null,null,null,0,0]
[1,0,0,1,0,0,0,0,"INFANTIL","F","MARTISCA SUSANU","MARÍA ADELINA","MARÍA ADELINA MARTISCA SUSANU","73293319R","2011-01-24",2011,14,1,14,"2025-01-03",227,"OS NABATERS D.F.",1,null,null,null,1,1,1,1,1,null,null,null,null,null,null,null,null,null,null,1,1,null,null,null,null,null,null,null,null,null,null,null,null,null,null,null,null,null,null,null,null,1,1,2,2]
[0,0,0,0,0,1,0,0,"JUVENIL","M","BOIRA GONZALO","LUIS FRANCISCO","LUIS FRANCISCO BOIRA GONZALO","73271015F","2008-05-23",2008,17,5,17,"2025-01-03",228,"OS NABATERS D.F.",1,null,null,null,1,1,1,1,1,null,null,null,null,null,null,null,null,null,null,1,1,null,null,null,null,null,null,null,null,null,null,null,null,null,null,null,null,null,null,null,null,null,null,1,1]
[0,0,0,0,0,0,0,1,"VETERANO","M","DE MIGUEL BENITO","ÁNGEL","ÁNGEL DE MIGUEL BENITO","17683021T","1952-04-30",1952,73,4,73,"2025-01-03",229,"OS NABATERS D.F.",1,1,null,null,1,1,1,1,1,null,null,null,null,null,null,null,null,null,null,null,null,null,null,null,null,null,null,null,null,null,null,null,null,null,null,null,null,null,null,null,null,null,null,0,0]
[1,0,0,0,0,0,1,0,"SENIOR","F","RUBIO EZPELETA","ANA","ANA RUBIO EZPELETA","17767678V","1997-10-12",1997,28,10,28,"2025-01-03",230,"OS NABATERS D.F.",1,null,null,null,1,1,1,1,1,null,null,null,null,null,null,null,null,null,null,null,null,null,null,null,null,null,null,null,null,null,null,null,null,null,null,null,null,null,null,null,null,null,null,0,0]
[0,0,0,0,0,0,0,1,"VETERANO","M","ALEXANDRU-GEORGESCU","EMANUEL","EMANUEL ALEXANDRU-GEORGESCU","X6052350S","1993-03-26",1993,32,3,32,"2025-01-03",231,"OS NABATERS D.F.",1,null,null,null,1,0,1,1,1,null,null,null,null,null,null,null,null,null,null,null,null,null,null,null,null,null,null,null,null,null,null,null,null,null,null,null,null,null,null,null,null,null,null,0,0]
[1,0,0,1,0,0,0,0,"INFANTIL","F","SORKHABI","YUSRA","YUSRA SORKHABI","X9476476Q","2011-03-27",2011,14,3,14,"2025-01-03",232,"OS NABATERS D.F.",1,null,null,null,1,1,1,1,1,null,null,null,null,null,null,null,null,null,null,null,null,null,null,null,null,null,null,null,null,null,null,null,null,null,null,null,null,null,null,null,null,null,null,0,0]
[{"$f":"IF(J236=\"F\", 1,0)","v":0},0,0,0,0,0,0,1,"VETERANO","M","LABORDA VAL","CLEMENTE FERNANDO","CLEMENTE FERNANDO LABORDA VAL","17196036V","1956-11-23",1956,69,11,69,"2025-01-03",233,"NAUTICO ZARAGOZA",1,null,null,null,1,1,1,1,1,null,null,null,null,null,null,null,null,null,null,null,null,null,null,null,null,null,null,null,null,null,null,null,null,null,null,null,null,null,null,null,null,null,null,0,0]
[0,0,0,0,0,0,0,1,"VETERANO","M","RUIZ IRIBARNE","IGNACIO JOSÉ","IGNACIO JOSÉ RUIZ IRIBARNE","17861548R","1958-04-12",1958,67,4,67,"2025-01-03",234,"NAUTICO ZARAGOZA",1,null,null,null,1,1,1,1,1,null,null,null,null,null,null,null,null,null,null,1,1,null,null,null,null,null,null,null,null,null,null,null,null,null,null,null,null,null,null,null,null,1,1,2,2]
[0,0,0,0,0,0,0,1,"VETERANO","M","LARROY CALVO","JOSÉ MANUEL","JOSÉ MANUEL LARROY CALVO","17201417Q","1958-08-02",1958,67,8,67,"2025-01-03",235,"NAUTICO ZARAGOZA",1,null,1,null,1,1,1,1,1,null,null,null,null,null,null,null,null,null,null,null,null,null,null,null,null,null,null,null,null,null,null,null,null,null,null,null,null,null,null,null,null,null,null,0,0]
[0,0,0,0,0,0,0,1,"VETERANO","M","TOBOSO MORENO","TEODORO","TEODORO TOBOSO MORENO","5113245T","1952-12-20",1952,73,12,73,"2025-01-03",236,"NAUTICO ZARAGOZA",1,null,null,null,1,1,1,1,1,null,null,null,null,null,null,null,null,null,null,1,1,null,null,null,null,null,null,null,null,null,null,null,null,null,null,null,null,null,null,null,null,1,1,2,2]
[0,0,0,0,0,0,1,0,"SENIOR","M","VILLARAVIZ CHAVES","ALBERTO","ALBERTO VILLARAVIZ CHAVES","30246237H","1997-06-19",1997,28,6,28,"2025-01-03",237,"CENTRO NATACION HELIOS",1,null,null,null,1,1,1,1,1,null,null,null,null,null,null,null,null,null,null,1,1,null,null,null,null,null,null,null,null,null,null,null,null,null,null,null,null,null,null,null,null,1,1,2,2]
[0,0,0,0,0,0,1,0,"SENIOR","M","PEÑA ROMERO DE TEJADA","JAIME",{"$f":"L241&\" \"& K241","v":"JAIME PEÑA ROMERO DE TEJADA"},"73104553L","1997-11-10",{"$f":"YEAR(O241)","v":1997},{"$f":"$Y$1-P241","v":28},{"$f":"MONTH(O241)","v":11},28,"2025-01-03",238,"OS NABATERS D.F.",1,null,null,null,1,1,1,1,1,null,null,null,null,null,null,null,null,null,null,null,null,null,null,null,null,null,null,null,null,null,null,null,null,null,null,null,null,null,null,null,null,1,1,{"$f":"AJ241+AL241+AN241+AP241+AR241+AT241+AV241+AX241+AZ241+BB241+BD241+BF241+BH241+BJ241+BL241","v":1},1]
[1,{"$f":"IF(I242=\"BENJAMIN\", 1,0)","v":0},{"$f":"IF(I242=\"ALEVIN\", 1,0)","v":0},{"$f":"IF(I242=\"INFANTIL\", 1,0)","v":0},{"$f":"IF(I242=\"CADETE\", 1,0)","v":0},{"$f":"IF(I242=\"JUVENIL\", 1,0)","v":0},{"$f":"IF(I242=\"SENIOR\", 1,0)","v":1},{"$f":"IF(I242=\"VETERANO\", 1,0)","v":0},"SENIOR","F","MARURI GARCÍA","ITZIAR","ITZIAR MARURI GARCÍA","25362548B","2003-06-09",2003,22,6,22,"2025-01-03",239,"OS NABATERS D.F.",1,null,null,null,1,1,1,1,1,null,null,null,null,null,null,null,null,null,null,1,1,null,null,null,null,null,null,null,null,null,null,null,null,null,null,null,null,null,null,null,null,null,null,1,1]
[0,{"$f":"IF(I243=\"BENJAMIN\", 1,0)","v":0},{"$f":"IF(I243=\"ALEVIN\", 1,0)","v":0},{"$f":"IF(I243=\"INFANTIL\", 1,0)","v":0},{"$f":"IF(I243=\"CADETE\", 1,0)","v":0},{"$f":"IF(I243=\"JUVENIL\", 1,0)","v":0},{"$f":"IF(I243=\"SENIOR\", 1,0)","v":1},0,"SENIOR","M","BERNAL LECINA","ÁNGEL","ÁNGEL BERNAL LECINA","17768021S","1998-07-20",1998,27,7,27,"2025-01-03",240,"OS NABATERS D.F.",1,1,null,null,1,0,1,1,1,null,null,null,null,null,null,null,null,null,null,1,1,null,null,null,null,null,null,null,null,null,null,null,null,null,null,null,null,null,null,null,null,null,null,1,1]
[0,0,0,0,0,0,1,0,"SENIOR","M","GRACIA ANDIANO","RAÚL","RAÚL GRACIA ANDIANO","73056301K","2002-05-04",2002,23,5,23,"2025-01-03",241,"OS NABATERS D.F.",1,null,null,null,1,1,1,1,1,null,null,null,null,null,null,null,null,null,null,1,1,null,null,null,null,null,null,null,null,null,null,null,null,null,null,null,null,null,null,null,null,null,null,1,1]
[0,0,0,0,0,0,1,0,"SENIOR","M","PELAYO BENEDET","TOMÁS","TOMÁS PELAYO BENEDET","73166844A","2000-06-18",2000,25,6,25,"2025-01-03",242,"OS NABATERS D.F.",1,null,null,null,1,0,1,1,1,null,null,null,null,null,null,null,null,null,null,1,0,null,null,null,null,null,null,null,null,null,null,null,null,null,null,null,null,null,null,null,null,null,null,1,0]
[1,0,0,0,0,0,1,0,"SENIOR","F","CANO GALLEGO","TATIANA","TATIANA CANO GALLEGO","26058015G","2000-11-13",2000,25,11,25,"2025-01-03",243,"OS NABATERS D.F.",1,null,null,null,1,0,1,1,1,null,null,null,null,null,null,null,null,null,null,1,1,null,null,null,null,null,null,null,null,null,null,null,null,null,null,null,null,null,null,null,null,1,1,2,2]
[1,0,0,0,0,0,1,0,"SENIOR","F","HERNANDO FERRER","ANDREA","ANDREA HERNANDO FERRER","73623276T","2004-09-02",2004,21,9,21,"2025-01-03",244,"OS NABATERS D.F.",1,null,null,null,1,1,1,1,1,null,null,null,null,null,null,null,null,null,null,1,1,null,null,null,null,null,null,null,null,null,null,null,null,null,null,null,null,null,null,null,null,null,null,1,1]
[0,0,0,0,0,0,1,0,"SENIOR","M","DÍAZ TORNIÉ","JHONATHAN ESTYVEN","JHONATHAN ESTYVEN DÍAZ TORNIÉ","Y8008724T","2003-02-18",2003,22,2,22,"2025-01-03",245,"OS NABATERS D.F.",1,null,null,null,1,1,1,1,1,null,null,null,null,null,null,null,null,null,null,1,1,null,null,null,null,null,null,null,null,null,null,null,null,null,null,null,null,null,null,null,null,1,1,2,2]
[1,0,0,0,0,0,0,1,"VETERANO","F","ESTEVAN EIXARCH","ALICIA PILAR","ALICIA PILAR ESTEVAN EIXARCH","25148844T","1966-03-21",1966,59,3,59,"2025-01-03",246,"OS NABATERS D.F.",1,null,null,null,1,1,1,1,0,null,null,null,null,null,null,null,null,null,null,null,null,null,null,null,null,null,null,null,null,null,null,null,null,null,null,null,null,null,null,null,null,null,null,0,0]
[0,0,0,0,0,0,0,1,"VETERANO","M","RUANO FERNÁNDEZ","GABRIEL JOSÉ","GABRIEL JOSÉ RUANO FERNÁNDEZ","29103088S","1969-03-14",1969,56,3,56,"2025-01-03",247,"OS NABATERS D.F.",1,null,null,null,1,1,1,1,1,null,null,null,null,null,null,null,null,null,null,null,null,null,null,null,null,null,null,null,null,null,null,null,null,null,null,null,null,null,null,null,null,null,null,0,0]
[0,0,0,0,0,0,0,1,"VETERANO","M","LAVILLA TENÍAS","SANTIAGO","SANTIAGO LAVILLA TENÍAS","17767598Y","1994-03-28",1994,31,3,31,"2025-01-03",248,"OS NABATERS D.F.",1,null,null,null,null,null,null,null,null,null,null,null,null,null,null,null,null,null,null,null,null,null,null,null,null,null,null,null,null,null,null,null,null,null,null,null,null,null,null,null,null,null,null,0,0]
[1,0,0,0,0,0,0,1,"VETERANO","F","ROMERO DE LA ROSA","ALICIA","ALICIA ROMERO DE LA ROSA","25195771F","1994-10-18",1994,31,10,31,"2025-01-03",249,"OS NABATERS D.F.",1,null,null,null,null,null,null,null,null,null,null,null,null,null,null,null,null,null,null,null,null,null,null,null,null,null,null,null,null,null,null,null,null,null,null,null,null,null,null,null,null,null,null,0,0]
[1,{"$f":"IF(I253=\"BENJAMIN\", 1,0)","v":0},{"$f":"IF(I253=\"ALEVIN\", 1,0)","v":0},{"$f":"IF(I253=\"INFANTIL\", 1,0)","v":0},{"$f":"IF(I253=\"CADETE\", 1,0)","v":0},{"$f":"IF(I253=\"JUVENIL\", 1,0)","v":0},{"$f":"IF(I253=\"SENIOR\", 1,0)","v":1},{"$f":"IF(I253=\"VETERANO\", 1,0)","v":0},"SENIOR","F","PEÑA ROMERO DE TEJADA","CELIA","CELIA PEÑA ROMERO DE TEJADA","73444632C","2002-10-01",2002,23,10,23,"2025-01-03",250,"OS NABATERS D.F.",1,null,null,null,1,0,1,1,0,null,null,null,null,null,null,null,null,null,null,null,null,null,null,null,null,null,null,null,null,null,null,null,null,null,null,null,null,null,null,null,null,null,null,0,0]
[1,{"$f":"IF(I254=\"BENJAMIN\", 1,0)","v":0},{"$f":"IF(I254=\"ALEVIN\", 1,0)","v":0},{"$f":"IF(I254=\"INFANTIL\", 1,0)","v":0},{"$f":"IF(I254=\"CADETE\", 1,0)","v":0},{"$f":"IF(I254=\"JUVENIL\", 1,0)","v":0},{"$f":"IF(I254=\"SENIOR\", 1,0)","v":1},0,"SENIOR","F","LAPLANA DÍAZ","CARLOTA","CARLOTA LAPLANA DÍAZ","73477515J","2005-01-18",2005,20,1,20,"2025-01-03",251,"OS NABATERS D.F.",1,null,null,null,1,1,1,1,1,null,null,null,null,null,null,null,null,null,null,null,null,null,null,null,null,null,null,null,null,null,null,null,null,null,null,null,null,null,null,null,null,null,null,0,0]
[0,0,0,0,0,0,1,0,"SENIOR","M","VILLACAMPA RÍOS","ALEJANDRO","ALEJANDRO VILLACAMPA RÍOS","49381001R","2000-02-09",2000,25,2,25,"2025-01-03",252,"OS NABATERS D.F.",1,null,null,null,1,1,1,1,1,null,null,null,null,null,null,null,null,null,null,null,null,null,null,null,null,null,null,null,null,null,null,null,null,null,null,null,null,null,null,null,null,null,null,0,0]
[0,0,0,0,0,0,0,1,"VETERANO","M","ROMEO GIL","JAVIER","JAVIER ROMEO GIL","29114890H","1974-04-21",1974,51,4,51,"2025-01-03",253,"OS NABATERS D.F.",1,null,null,null,null,null,null,null,null,null,null,null,null,null,null,null,null,null,null,null,null,null,null,null,null,null,null,null,null,null,null,null,null,null,null,null,null,null,null,null,null,null,null,0,0]
[0,0,0,0,0,0,1,0,"SENIOR","M","COSA REDONDO","BORJA","BORJA COSA REDONDO","18458680F","2000-10-06",2000,25,10,25,"2025-01-03",254,"OS NABATERS D.F.",1,null,null,null,1,1,1,1,1,null,null,null,null,null,null,null,null,null,null,null,null,null,null,null,null,null,null,null,null,null,null,null,null,null,null,null,null,null,null,null,null,null,null,0,0]
[0,0,0,0,0,0,0,1,"VETERANO","M","VERA RUBERT","ANTONIO MIGUEL",{"$f":"L258&\" \"& K258","v":"ANTONIO MIGUEL VERA RUBERT"},"73189189S","1961-05-25",1961,64,5,64,"2025-03-27",255,"CAPRI MEQUINENZA",1,null,null,null,1,1,1,1,1,null,null,null,null,null,null,null,null,null,null,null,null,null,null,null,null,null,null,null,null,null,null,null,null,null,null,null,null,null,null,null,null,null,null,{"$f":"AJ258+AL258+AN258+AP258+AR258+AT258+AV258+AX258+AZ258+BB258+BD258+BF258+BH258+BJ258+BL258","v":0},{"$f":"AK258+AM258+AO258+AQ258+AS258+AU258+AW258+AY258+BA258+BC258+BE258+BG258+BI258+BK258+BM258","v":0}]
[0,0,0,0,0,0,0,1,"VETERANO","M","MARTÍNEZ CABELLO","PEDRO IGNACIO","PEDRO IGNACIO MARTÍNEZ CABELLO","17694366Y","1957-04-24",1957,68,4,68,"2025-04-08",256,"OS NABATERS D.F.",null,null,1,null,1,1,1,1,1,null,null,null,null,null,null,null,null,null,null,null,null,null,null,null,null,null,null,null,null,null,null,null,null,null,null,null,null,null,null,null,null,null,null,0,0]
[1,{"$f":"IF(I260=\"BENJAMIN\", 1,0)","v":0},{"$f":"IF(I260=\"ALEVIN\", 1,0)","v":0},{"$f":"IF(I260=\"INFANTIL\", 1,0)","v":0},{"$f":"IF(I260=\"CADETE\", 1,0)","v":0},{"$f":"IF(I260=\"JUVENIL\", 1,0)","v":1},{"$f":"IF(I260=\"SENIOR\", 1,0)","v":0},{"$f":"IF(I260=\"VETERANO\", 1,0)","v":0},"JUVENIL","F","ASO LÓPEZ","CLAUDIA","CLAUDIA ASO LÓPEZ","73032358K","2008-05-07",2008,17,5,{"$f":"DATEDIF(O260,TODAY(),\"Y\")","v":17},"2025-04-08",257,"OS NABATERS D.F.",1,null,null,null,1,1,1,1,1,null,null,null,null,null,null,null,null,null,null,null,null,null,null,null,null,null,null,null,null,null,null,null,null,null,null,null,null,null,null,null,null,null,null,0,0]
[0,{"$f":"IF(I261=\"BENJAMIN\", 1,0)","v":0},{"$f":"IF(I261=\"ALEVIN\", 1,0)","v":0},{"$f":"IF(I261=\"INFANTIL\", 1,0)","v":0},{"$f":"IF(I261=\"CADETE\", 1,0)","v":0},{"$f":"IF(I261=\"JUVENIL\", 1,0)","v":0},{"$f":"IF(I261=\"SENIOR\", 1,0)","v":0},{"$f":"IF(I261=\"VETERANO\", 1,0)","v":1},"VETERANO","M","IBARRA","LUIS ALBERTO","LUIS ALBERTO IBARRA","Z0751970J","1986-01-07",1986,39,1,39,"2025-04-08",258,"OS NABATERS D.F.",1,null,null,null,1,1,1,1,1,null,null,null,null,null,null,null,null,null,null,null,null,null,null,null,null,null,null,null,null,null,null,null,null,null,null,null,null,null,null,null,null,null,null,0,0]
[0,0,0,0,0,0,0,1,"VETERANO","M","HERNÁNDEZ RODRÍGUEZ","FRANCISCO","FRANCISCO HERNÁNDEZ RODRÍGUEZ","17140975H","1957-01-03",1957,68,1,68,"2025-04-08",259,"OS NABATERS D.F.",1,null,null,null,1,0,0,0,0,null,null,null,null,null,null,null,null,null,null,null,null,null,null,null,null,null,null,null,null,null,null,null,null,null,null,null,null,null,null,null,null,null,null,0,0]
[1,0,0,1,0,0,0,0,"INFANTIL","F","RELANCIO PASTOR","MATILDE ESTRELLA","MATILDE ESTRELLA RELANCIO PASTOR","26282294X","2011-11-10",2011,14,11,14,"2025-04-08",260,"CENTRO NATACION HELIOS",1,null,null,null,1,1,1,1,1,null,null,null,null,1,null,1,null,null,null,1,1,null,null,null,null,null,null,null,null,null,null,null,null,null,null,null,null,null,null,null,null,1,1,4,2]
[1,0,0,0,0,0,0,1,"VETERANO","F","FERNÁNDEZ RUIZ","MARÍA AZUCENA","MARÍA AZUCENA FERNÁNDEZ RUIZ","29120501V","1976-05-09",1976,49,5,49,"2025-04-21",261,"OS NABATERS D.F.",1,null,null,null,1,1,1,1,1,null,null,null,null,null,null,null,null,null,null,1,1,null,null,null,null,null,null,null,null,null,null,null,null,null,null,null,null,null,null,null,null,1,1,2,2]
[0,0,0,0,0,0,0,1,"VETERANO","M","BARRERA RAMOS","JOSÉ SALVADOR","JOSÉ SALVADOR BARRERA RAMOS","N15491821","1980-12-30",1980,45,12,44,"2025-04-21",262,"OS NABATERS D.F.",1,null,null,null,1,1,1,1,1,null,null,null,null,null,null,null,null,null,null,1,1,null,null,null,null,null,null,null,null,null,null,null,null,null,null,null,null,null,null,null,null,1,1,2,2]
[1,0,0,0,0,0,1,0,"SENIOR","F","VALVERDE ANDRÉS","KIARA","KIARA VALVERDE ANDRÉS","54752046V","2005-01-27",2005,20,1,20,"2025-04-29",263,"CAPRI MEQUINENZA",1,null,null,null,1,1,1,1,1,null,null,null,null,null,null,null,null,null,null,null,null,null,null,null,null,null,null,null,null,null,null,null,null,null,null,null,null,null,null,null,null,null,null,0,0]
[0,0,0,0,0,0,0,1,"VETERANO","M","MELGARES HIDALGO","CARLOS","CARLOS MELGARES HIDALGO","17695224J","1956-12-31",1956,69,12,68,"2025-05-06",264,"CENTRO NATACION HELIOS",1,null,null,null,1,1,1,1,1,null,null,null,null,1,null,1,null,null,null,null,null,null,null,null,null,null,null,null,null,null,null,null,null,null,null,null,null,null,null,null,null,null,null,2,0]
[0,0,0,0,0,0,0,1,"VETERANO","M","LARROSA AZNAR","SERGIO","SERGIO LARROSA AZNAR","25162264B","1972-05-20",1972,53,5,53,"2025-05-06",265,"CENTRO NATACION HELIOS",1,null,null,null,1,1,1,1,1,null,null,null,null,null,null,null,null,null,null,null,null,null,null,null,null,null,null,null,null,null,null,null,null,null,null,null,null,null,null,null,null,null,null,0,0]
[0,0,0,1,0,0,0,0,"INFANTIL","M","SORO FUENTES","JOAQUÍN JESÚS","JOAQUÍN JESÚS SORO FUENTES","73478867P","2011-10-16",2011,14,10,14,"2025-05-06",266,"CENTRO NATACION HELIOS",1,null,null,null,1,1,1,1,1,null,null,null,null,null,null,null,null,null,null,null,null,null,null,null,null,null,null,null,null,null,null,null,null,null,null,null,null,null,null,null,null,null,null,0,0]
[0,0,0,0,0,0,0,1,"VETERANO","M","AURED ANTÓN","SERGIO","SERGIO AURED ANTÓN","25483490L","1978-06-11",1978,47,6,47,"2025-05-07",267,"OS NABATERS D.F.",1,null,null,null,null,null,null,null,null,null,null,null,null,null,null,1,null,null,null,null,null,null,null,null,null,null,null,null,null,null,null,null,null,null,null,null,null,null,null,null,null,null,null,1,0]
[0,0,0,0,0,0,1,0,"SENIOR","M","MUÑOZ LAHOZ","JUAN JOSÉ",{"$f":"L271&\" \"& K271","v":"JUAN JOSÉ MUÑOZ LAHOZ"},"26056479D","2005-11-17",2005,20,11,20,"2024-05-28",268,"OS NABATERS D.F.",1,null,null,null,1,1,1,1,1,null,null,null,null,null,null,null,null,null,null,null,null,null,null,null,null,null,null,null,null,null,null,null,null,null,null,null,null,null,null,null,null,null,null,{"$f":"AJ271+AL271+AN271+AP271+AR271+AT271+AV271+AX271+AZ271+BB271+BD271+BF271+BH271+BJ271+BL271","v":0},0]
[0,0,0,0,0,0,1,0,"SENIOR","M","MUÑOZ LÓPEZ","JUAN",{"$f":"L272&\" \"& K272","v":"JUAN MUÑOZ LÓPEZ"},"25202497V","2000-02-12",2000,25,2,25,"2024-05-28",269,"OS NABATERS D.F.",1,null,null,null,1,0,1,1,1,null,null,null,null,null,null,null,null,null,null,null,null,null,null,null,null,null,null,null,null,null,null,null,null,null,null,null,null,null,null,null,null,null,null,0,0]
[0,0,0,0,0,0,1,0,"SENIOR","M","OLLOQUI LÁZARO","PEDRO",{"$f":"L273&\" \"& K273","v":"PEDRO OLLOQUI LÁZARO"},"77134640T","2005-08-16",2005,20,8,20,"2024-05-28",270,"OS NABATERS D.F.",1,null,null,null,1,0,1,1,1,null,null,null,null,null,null,null,null,null,null,null,null,null,null,null,null,null,null,null,null,null,null,null,null,null,null,null,null,null,null,null,null,null,null,0,0]
[{"$f":"IF(J274=\"F\", 1,0)","v":0},{"$f":"IF(I274=\"BENJAMIN\", 1,0)","v":0},{"$f":"IF(I274=\"ALEVIN\", 1,0)","v":0},{"$f":"IF(I274=\"INFANTIL\", 1,0)","v":0},{"$f":"IF(I274=\"CADETE\", 1,0)","v":0},{"$f":"IF(I274=\"JUVENIL\", 1,0)","v":0},{"$f":"IF(I274=\"SENIOR\", 1,0)","v":0},{"$f":"IF(I274=\"VETERANO\", 1,0)","v":1},"VETERANO","M","REINADO VIRGILI","JOSEP",{"$f":"L274&\" \"& K274","v":"JOSEP REINADO VIRGILI"},"47696921G","1988-10-20",{"$f":"YEAR(O274)","v":1988},37,{"$f":"MONTH(O274)","v":10},37,"2025-08-15",271,"CAPRI MEQUINENZA",1,null,null,null,1,1,1,1,1,null,null,null,null,null,null,null,null,null,null,null,null,null,null,null,null,null,null,null,null,null,null,null,null,null,null,null,null,null,null,null,null,null,null,{"$f":"AJ274+AL274+AN274+AP274+AR274+AT274+AV274+AX274+AZ274+BB274+BD274+BF274+BH274+BJ274+BL274","v":0},0]
[0,{"$f":"IF(I275=\"B\", 1,0)","v":0},{"$f":"IF(I275=\"A\", 1,0)","v":0},{"$f":"IF(I275=\"I\", 1,0)","v":0},{"$f":"IF(I275=\"C\", 1,0)","v":0},{"$f":"IF(I275=\"J\", 1,0)","v":0},{"$f":"IF(I275=\"S\", 1,0)","v":0},{"$f":"IF(I275=\"V\", 1,0)","v":0},"ALEVIN","M","CANTERO ANDRÉS","ALEJANDRO","ALEJANDRO CANTERO ANDRÉS","09825494D","2014-09-12",{"$f":"YEAR(O275)","v":2014},11,{"$f":"MONTH(O275)","v":9},11,"2025-08-22",272,"CAPRI MEQUINENZA",1,null,null,null,1,1,1,1,1,null,null,null,null,null,null,null,null,null,null,null,null,null,null,null,null,null,null,null,null,null,null,null,null,null,null,null,null,null,null,null,null,null,null,{"$f":"AJ275+AL275+AN275+AP275+AR275+AT275+AV275+AX275+AZ275+BB275+BD275+BF275+BH275+BJ275+BL275","v":0},0]
[0,0,0,0,0,0,0,0,"ALEVIN","M","PI MOSOVSKA","ANDREW","ANDREW PI MOSOVSKA","49943189T","2014-06-30",2014,11,6,11,"2025-08-22",273,"CAPRI MEQUINENZA",1,null,null,null,1,1,1,1,0,null,null,null,null,null,null,null,null,null,null,null,null,null,null,null,null,null,null,null,null,null,null,null,null,null,null,null,null,null,null,null,null,null,null,0,0]
[1,0,0,0,0,0,0,0,"BENJAMIN","F","LLOP RUEDA","ALICIA","ALICIA LLOP RUEDA","26606280H","2015-11-28",2015,10,11,10,"2025-08-22",274,"CAPRI MEQUINENZA",1,null,null,null,1,1,1,1,1,null,null,null,null,null,null,null,null,null,null,null,null,null,null,null,null,null,null,null,null,null,null,null,null,null,null,null,null,null,null,null,null,null,null,0,0]
[0,0,0,0,0,0,0,0,"ALEVIN","M","ROCA VENTURA","ERIC","ERIC ROCA VENTURA","-","2014-12-29",2014,11,12,10,"2025-08-22",275,"CAPRI MEQUINENZA",1,null,null,null,1,1,1,1,1,null,null,null,null,null,null,null,null,null,null,null,null,null,null,null,null,null,null,null,null,null,null,null,null,null,null,null,null,null,null,null,null,null,null,0,0]
[1,0,0,0,0,0,0,0,"BENJAMIN","F","JUSTE IBARZ","YUNE","YUNE JUSTE IBARZ","098251130J","2015-02-19",2015,10,2,10,"2025-08-22",276,"CAPRI MEQUINENZA",1,null,null,null,0,1,1,1,1,null,null,null,null,null,null,null,null,null,null,null,null,null,null,null,null,null,null,null,null,null,null,null,null,null,null,null,null,null,null,null,null,null,null,0,0]
[0,0,0,0,0,0,0,0,"VETERANO","M","ROMERA MURILLO","EDUARDO","EDUARDO ROMERA MURILLO","73151020A","1958-01-02",1958,67,1,67,"2025-08-22",277,"CAPRI MEQUINENZA",1,null,null,null,1,0,0,0,0,null,null,null,null,null,null,null,null,null,null,null,null,null,null,null,null,null,null,null,null,null,null,null,null,null,null,null,null,null,null,null,null,null,null,0,0]
[0,0,0,0,0,0,0,0,"VETERANO","M","CATALAN MULA","JUAN ANTONIO ","JUAN ANTONIO  CATALAN MULA","73157353B","1974-08-18",1974,51,8,51,"2025-09-23",278,"CAPRI MEQUINENZA",1,null,null,null,null,null,null,null,null,null,null,null,null,null,null,null,null,null,null,null,null,null,null,null,null,null,null,null,null,null,null,null,null,null,null,null,null,null,null,null,null,null,null,0,0]
[1,0,0,0,0,0,0,0,"VETERANO","F","LLOP CALLIZO","MERITXELL ","MERITXELL  LLOP CALLIZO","73086549R","1984-08-23",1984,41,8,41,"2025-09-23",279,"CAPRI MEQUINENZA",1,null,null,null,null,null,null,null,null,null,null,null,null,null,null,null,null,null,null,null,null,null,null,null,null,null,null,null,null,null,null,null,null,null,null,null,null,null,null,null,null,null,null,0,0]
[0,0,0,0,0,0,0,0,"VETERANO","M","MIR IBARZ","ORIOL ","ORIOL  MIR IBARZ","7546K3086","1987-09-06",1987,38,9,38,"2025-09-23",280,"CAPRI MEQUINENZA",1,null,null,null,null,null,null,null,null,null,null,null,null,null,null,null,null,null,null,null,null,null,null,null,null,null,null,null,null,null,null,null,null,null,null,null,null,null,null,null,null,null,null,0,0]
[0,0,0,0,0,0,0,0,"VETERANO","M","TORO SOLER","DAVID","DAVID TORO SOLER","76922443R","1985-07-18",1985,40,7,40,"2025-09-23",281,"CAPRI MEQUINENZA",1,null,null,null,null,null,null,null,null,null,null,null,null,null,null,null,null,null,null,null,null,null,null,null,null,null,null,null,null,null,null,null,null,null,null,null,null,null,null,null,null,null,null,0,0]
[1,0,0,0,0,0,0,0,"SENIOR","F","GRAU BURRIEL","JUDITH ","JUDITH  GRAU BURRIEL","49536538N","2025-08-30",2005,20,8,0,"2025-09-23",282,"CAPRI MEQUINENZA",1,null,null,null,null,null,null,null,null,null,null,null,null,null,null,null,null,null,null,null,null,null,null,null,null,null,null,null,null,null,null,null,null,null,null,null,null,null,null,null,null,null,null,0,0]
[0,0,0,0,0,0,0,0,"INFANTIL","M","ESCALONA VILLACAMPA","JOKIN KOLDO","JOKIN KOLDO ESCALONA VILLACAMPA","21748357V","2012-04-02",2012,13,4,13,"2025-09-23",283,"CAPRI MEQUINENZA",1,null,null,null,null,null,null,null,null,null,null,null,null,null,null,null,null,null,null,null,null,null,null,null,null,null,null,null,null,null,null,null,null,null,null,null,null,null,null,null,null,null,null,0,0]
[0,0,0,0,0,0,0,{"$f":"IF(I287=\"V\", 1,0)","v":0},"VETERANO","M","ALDABÓ LABAILA","RUBÉN ","RUBÉN  ALDABÓ LABAILA","73208657W","1983-10-25",1983,42,10,42,"2025-09-23",284,"CAPRI MEQUINENZA",1,null,null,null,null,null,null,null,null,null,null,null,null,null,null,null,null,null,null,null,null,null,null,null,null,null,null,null,null,null,null,null,null,null,null,null,null,null,null,null,null,null,null,0,0]
[1,0,0,0,0,0,0,0,"ALEVIN","F","CABALLERO DE TORO","ALICIA","ALICIA CABALLERO DE TORO","50090040A","2013-01-27",{"$f":"YEAR(O288)","v":2013},12,1,12,"2025-09-24",285,"OS NABATERS",1,null,null,null,null,null,null,null,null,null,null,null,null,null,null,null,null,null,null,null,null,null,1,null,null,null,null,null,null,null,null,null,null,null,null,null,null,null,null,null,null,null,null,{"$f":"AJ288+AL288+AN288+AP288+AR288+AT288+AV288+AX288+AZ288+BB288+BD288+BF288+BH288+BJ288+BL288","v":0},1]
[1,0,0,0,0,0,0,0,"SENIOR","F","VICENTE MAGAÑA","LEGA","LEGA VICENTE MAGAÑA","30335167F","2005-09-05",2005,20,9,20,"2025-09-24",286,"OS NABATERS",1,null,null,null,null,null,null,null,null,null,null,null,null,null,null,null,null,null,null,null,null,null,1,null,null,null,null,null,null,null,null,null,null,null,null,null,null,null,null,null,null,null,null,0,1]
[1,0,0,0,0,0,0,0,"SENIOR","F","LÓPEZ CORDOVILLA","ALBA","ALBA LÓPEZ CORDOVILLA","73055467S","2002-02-16",2002,23,2,23,"2025-09-24",287,"OS NABATERS",1,null,null,null,null,null,null,null,null,null,null,null,null,null,null,null,null,null,null,null,null,null,1,null,null,null,null,null,null,null,null,null,null,null,null,null,null,null,null,null,null,null,null,0,1]
[0,0,0,0,0,0,0,0,"VETERANO","M","YUS DÍEZ","JESÚS","JESÚS YUS DÍEZ","73029221N","1994-10-30",1994,31,10,31,"2025-10-06",288,"OS NABATERS",1,null,null,null,1,0,1,1,1,null,null,null,null,null,null,null,null,null,null,null,null,null,null,null,null,null,null,null,null,null,null,null,null,null,null,null,null,null,null,null,null,null,null,0,0]
[0,0,0,0,0,0,0,0,"VETERANO","M","SANJUAN SOLER","CARLOS","CARLOS SANJUAN SOLER","40875177Z","1962-04-24",1962,63,4,63,"2025-10-20",289,"CAPRI MEQUINENZA",1,null,null,null,1,1,1,1,1,null,null,null,null,null,null,null,null,null,null,null,null,null,null,null,null,null,null,null,null,null,null,null,null,null,null,null,null,null,null,null,null,null,null,0,0]
[0,0,0,0,0,0,0,0,"VETERANO","M","PALAU MARIMÓN","JOSÉ RAMÓN","JOSÉ RAMÓN PALAU MARIMÓN","78083387C","1983-12-08",1983,42,12,42,"2025-10-20",290,"CAPRI MEQUINENZA",1,null,null,null,1,1,1,1,1,null,null,null,null,null,null,null,null,null,null,null,null,null,null,null,null,null,null,null,null,null,null,null,null,null,null,null,null,null,null,null,null,null,null,0,0]
[0,0,0,0,0,0,0,0,"INFANTIL","M","DUCE CASCANTE","ALEJANDRO",{"$f":"L294&\" \"& K294","v":"ALEJANDRO DUCE CASCANTE"},"13353469Z","2011-11-10",{"$f":"YEAR(O294)","v":2011},{"$f":"$AC$1-P294","v":13},{"$f":"MONTH(O294)","v":11},14,"2025-11-13",291,"OS NABATERS D.F.",1,null,null,null,1,0,1,1,0,null,null,null,null,null,null,null,null,null,null,null,null,null,null,null,null,null,null,null,null,null,null,null,null,null,null,null,null,null,null,null,null,null,null,{"$f":"AJ294+AL294+AN294+AP294+AR294+AT294+AV294+AX294+AZ294+BB294+BD294+BF294+BH294+BJ294+BL294","v":0},0]
[0,0,0,0,0,0,0,0,"BENJAMIN","M","HIDALGO FERNÁNDEZ","LEO",{"$f":"L295&\" \"& K295","v":"LEO HIDALGO FERNÁNDEZ"},null,"2014-12-12",2014,10,12,11,"2025-11-13",292,"OS NABATERS D.F.",1,null,null,null,1,1,1,1,1,null,null,null,null,null,null,null,null,null,null,null,null,null,null,null,null,null,null,null,null,null,null,null,null,null,null,null,null,null,null,null,null,null,null,0,0]
[1,0,0,0,0,0,0,0,"ALEVIN","F","GIMENO BACHILLER","SIENA","SIENA GIMENO BACHILLER","73237642F","2013-06-16",2013,11,6,12,"2025-11-13",293,"OS NABATERS D.F.",1,null,null,null,1,1,1,1,1,null,null,null,null,null,null,null,null,null,null,null,null,null,null,null,null,null,null,null,null,null,null,null,null,null,null,null,null,null,null,null,null,null,null,0,0]
[0,0,0,0,0,0,0,0,"BENJAMIN","M","OBENSA SIERRA","JORGE","JORGE OBENSA SIERRA","73622220W","2014-08-05",2014,10,8,11,"2025-11-13",294,"OS NABATERS D.F.",1,null,null,null,1,1,1,1,1,null,null,null,null,null,null,null,null,null,null,null,null,null,null,null,null,null,null,null,null,null,null,null,null,null,null,null,null,null,null,null,null,null,null,0,0]
[0,0,0,0,0,0,0,0,"ALEVIN","M","SORIA GARCÍA","RUBÉN","RUBÉN SORIA GARCÍA","26307901H","2013-01-10",2013,11,1,12,"2025-11-13",295,"OS NABATERS D.F.",1,null,null,null,1,1,1,1,1,null,null,null,null,null,null,null,null,null,null,null,null,null,null,null,null,null,null,null,null,null,null,null,null,null,null,null,null,null,null,null,null,null,null,0,0]
[1,0,0,0,0,0,0,0,"SENIOR","F","DE MIGUEL GRACIA","RAQUEL","RAQUEL DE MIGUEL GRACIA","73475879X","2002-05-12",2002,22,5,23,"2025-12-12",296,"OS NABATERS D.F.",1,null,null,null,1,1,1,1,1,null,null,null,null,null,null,null,null,null,null,null,null,null,null,null,null,null,null,null,null,null,null,null,null,null,null,null,null,null,null,null,null,null,null,0,0]
[null,null,null,null,null,null,null,null,"BENJAMIN",null,null,null,null,null,null,null,null,null,null,"2025-01-03"]
[{"$f":"IF(J301=\"F\", 1,0)","v":0},{"$f":"IF(I301=\"B\", 1,0)","v":0},{"$f":"IF(I301=\"A\", 1,0)","v":0},{"$f":"IF(I301=\"I\", 1,0)","v":0},{"$f":"IF(I301=\"C\", 1,0)","v":0},{"$f":"IF(I301=\"J\", 1,0)","v":0},{"$f":"IF(I301=\"S\", 1,0)","v":0},{"$f":"IF(I301=\"V\", 1,0)","v":0},"JUVENIL",null,"ESTEVE CASTELLÓ","AARÓN",{"$f":"L301&\" \"& K301","v":"AARÓN ESTEVE CASTELLÓ"},"21747085X","2008-07-17",{"$f":"YEAR(O301)","v":2008},{"$f":"$Y$1-P301","v":17},{"$f":"MONTH(O301)","v":7},null,"2025-01-03",null,null,null,null,null,null,null,null,null,null,null,null,null,null,null,null,null,null,null,null,null,null,null,null,null,null,null,null,null,null,null,null,null,null,null,null,null,null,null,null,null,null,null,null,null,{"$f":"AJ301+AL301+AN301+AP301+AR301+AT301+AV301+AX301+AZ301+BB301+BD301+BF301+BH301+BJ301+BL301","v":0},0]
[0,0,0,0,0,0,0,0,"VETERANO",null,"SIMÓN TRIGUEROS","ABDÍAS","ABDÍAS SIMÓN TRIGUEROS","48473820D","1987-09-30",1987,38,9,null,"2025-01-03",null,null,null,null,null,null,null,null,null,null,null,null,null,null,null,null,null,null,null,null,null,null,null,null,null,null,null,null,null,null,null,null,null,null,null,null,null,null,null,null,null,null,null,null,null,0,0]
[0,0,0,0,0,0,0,0,"VETERANO",null,"BORBÓN RODRÍGUEZ","ABEL","ABEL BORBÓN RODRÍGUEZ",null,null,1900,125,1,null,"2025-01-03",null,null,null,null,null,null,null,null,null,null,null,null,null,null,null,null,null,null,null,null,null,null,null,null,null,null,null,null,null,null,null,null,null,null,null,null,null,null,null,null,null,null,null,null,null,0,0]
[0,0,0,0,0,0,0,0,"SENIOR",null,"ESTEBAN GARCÍA","ABRIL","ABRIL ESTEBAN GARCÍA","48052629V","2004-07-03",2004,21,7,null,"2025-01-03",null,null,null,null,null,null,null,null,null,null,null,null,null,null,null,null,null,null,null,null,null,null,null,null,null,null,null,null,null,null,null,null,null,null,null,null,null,null,null,null,null,null,null,null,null,0,0]
[0,0,0,0,0,0,0,0,"VETERANO",null,"PÉREZ-ILZARBE ORTIZ","ADRIANA","ADRIANA PÉREZ-ILZARBE ORTIZ",null,null,1900,125,1,null,"2025-01-03",null,null,null,null,null,null,null,null,null,null,null,null,null,null,null,null,null,null,null,null,null,null,null,null,null,null,null,null,null,null,null,null,null,null,null,null,null,null,null,null,null,null,null,null,null,0,0]
[0,0,0,0,0,0,0,0,"ALEVIN",null,"GUARDIOLA BARTOLOMÉ","AFRICA","AFRICA GUARDIOLA BARTOLOMÉ","09825021L","2013-10-18",2013,12,10,null,"2025-01-03",null,null,null,null,null,null,null,null,null,null,null,null,null,null,null,null,null,null,null,null,null,null,null,null,null,null,null,null,null,null,null,null,null,null,null,null,null,null,null,null,null,null,null,null,null,0,0]
[0,0,0,0,0,0,0,0,"SENIOR",null,"LERMA CLAVERO","ÁFRICA","ÁFRICA LERMA CLAVERO","73428784L","1998-10-07",1998,27,10,null,"2025-01-03",null,null,null,null,null,null,null,null,null,null,null,null,null,null,null,null,null,null,null,null,null,null,null,null,null,null,null,null,null,null,null,null,null,null,null,null,null,null,null,null,null,null,null,null,null,0,0]
[0,0,0,0,0,0,0,0,"VETERANO",null,"SALO LORÉS","AITOR","AITOR SALO LORÉS","47682870Y","1980-10-22",1980,45,10,null,"2025-01-03",null,null,null,null,null,null,null,null,null,null,null,null,null,null,null,null,null,null,null,null,null,null,null,null,null,null,null,null,null,null,null,null,null,null,null,null,null,null,null,null,null,null,null,null,null,0,0]
[0,0,0,0,0,0,0,0,"SENIOR",null,"LÓPEZ DE LEÓN","ALBA","ALBA LÓPEZ DE LEÓN","77134341T","1995-07-05",1995,30,7,null,"2025-01-03",null,null,null,null,null,null,null,null,null,null,null,null,null,null,null,null,null,null,null,null,null,null,null,null,null,null,null,null,null,null,null,null,null,null,null,null,null,null,null,null,null,null,null,null,null,0,0]
[0,0,0,0,0,0,0,0,"SENIOR",null,"MANERO HERRERO","ALBA","ALBA MANERO HERRERO","45721880L","2001-10-12",2001,24,10,null,"2025-01-03",null,null,null,null,null,null,null,null,null,null,null,null,null,null,null,null,null,null,null,null,null,null,null,null,null,null,null,null,null,null,null,null,null,null,null,null,null,null,null,null,null,null,null,null,null,0,0]
[0,0,0,0,0,0,0,0,"VETERANO",null,"FERNÁNDEZ DÍEZ","ALBERTO","ALBERTO FERNÁNDEZ DÍEZ",null,"1984-01-12",1984,41,1,null,"2025-01-03",null,null,null,null,null,null,null,null,null,null,null,null,null,null,null,null,null,null,null,null,null,null,null,null,null,null,null,null,null,null,null,null,null,null,null,null,null,null,null,null,null,null,null,null,null,0,0]
[0,0,0,0,0,0,0,0,"JUVENIL",null,"FERNÁNDEZ SANZ","ALBERTO","ALBERTO FERNÁNDEZ SANZ","73413709D","2007-07-22",2007,18,7,null,"2025-01-03",null,null,null,null,null,null,null,null,null,null,null,null,null,null,null,null,null,null,null,null,null,null,null,null,null,null,null,null,null,null,null,null,null,null,null,null,null,null,null,null,null,null,null,null,null,0,0]
[0,0,0,0,0,0,0,0,"VETERANO",null,"GARAICOECHEA SÁNCHEZ","ALBERTO","ALBERTO GARAICOECHEA SÁNCHEZ",null,"1959-06-21",1959,66,6,null,"2025-01-03",null,null,null,null,null,null,null,null,null,null,null,null,null,null,null,null,null,null,null,null,null,null,null,null,null,null,null,null,null,null,null,null,null,null,null,null,null,null,null,null,null,null,null,null,null,0,0]
[0,0,0,0,0,0,0,0,"CADETE",null,"IBARZ BERENGUER","ALEIX","ALEIX IBARZ BERENGUER","52037049D","2010-09-07",2010,15,9,null,"2025-01-03",null,null,null,null,null,null,null,null,null,null,null,null,null,null,null,null,null,null,null,null,null,null,null,null,null,null,null,null,null,null,null,null,null,null,null,null,null,null,null,null,null,null,null,null,null,0,0]
[0,0,0,0,0,0,0,0,"SENIOR",null,"ABECIA SEGARRA","ALEJANDRO","ALEJANDRO ABECIA SEGARRA","73029378P","1998-04-21",1998,27,4,null,"2025-01-03",null,null,null,null,null,null,null,null,null,null,null,null,null,null,null,null,null,null,null,null,null,null,null,null,null,null,null,null,null,null,null,null,null,null,null,null,null,null,null,null,null,null,null,null,null,0,0]
[0,0,0,0,0,0,0,0,"SENIOR",null,"ABRIL CASAMAYOR","ALEJANDRO","ALEJANDRO ABRIL CASAMAYOR","73022037G","2001-05-27",2001,24,5,null,"2025-01-03",null,null,null,null,null,null,null,null,null,null,null,null,null,null,null,null,null,null,null,null,null,null,null,null,null,null,null,null,null,null,null,null,null,null,null,null,null,null,null,null,null,null,null,null,null,0,0]
[0,0,0,0,0,0,0,0,"SENIOR",null,"UTRILLA ABUELO","ALEJANDRO MANUEL","ALEJANDRO MANUEL UTRILLA ABUELO","25360740C","1996-02-16",1996,29,2,null,"2025-01-03",null,null,null,null,null,null,null,null,null,null,null,null,null,null,null,null,null,null,null,null,null,null,null,null,null,null,null,null,null,null,null,null,null,null,null,null,null,null,null,null,null,null,null,null,null,0,0]
[0,0,0,0,0,0,0,0,"SENIOR",null,"VARGAS PITAR","ALEJANDRO","ALEJANDRO VARGAS PITAR","73613687W","2001-07-11",2001,24,7,null,"2025-01-03",null,null,null,null,null,null,null,null,null,null,null,null,null,null,null,null,null,null,null,null,null,null,null,null,null,null,null,null,null,null,null,null,null,null,null,null,null,null,null,null,null,null,null,null,null,0,0]
[0,0,0,0,0,0,0,0,"SENIOR",null,"PÉREZ BERNAD","ALEXANDRA","ALEXANDRA PÉREZ BERNAD","77135027L","1997-09-26",1997,28,9,null,"2025-01-03",null,null,null,null,null,null,null,null,null,null,null,null,null,null,null,null,null,null,null,null,null,null,null,null,null,null,null,null,null,null,null,null,null,null,null,null,null,null,null,null,null,null,null,null,null,0,0]
[0,0,0,0,0,0,0,0,"CADETE",null,"GODIA PI","ALEXIA","ALEXIA GODIA PI","21747083P","2009-03-18",2009,16,3,null,"2025-01-03",null,null,null,null,null,null,null,null,null,null,null,null,null,null,null,null,null,null,null,null,null,null,null,null,null,null,null,null,null,null,null,null,null,null,null,null,null,null,null,null,null,null,null,null,null,0,0]
[0,0,0,0,0,0,0,0,"VETERANO",null,"CORTÍ BETRIÁN","ALICIA","ALICIA CORTÍ BETRIÁN","49382972V","1970-11-16",1970,55,11,null,"2025-01-03",null,null,null,null,null,null,null,null,null,null,null,null,null,null,null,null,null,null,null,null,null,null,null,null,null,null,null,null,null,null,null,null,null,null,null,null,null,null,null,null,null,null,null,null,null,0,0]
[0,0,0,0,0,0,0,0,"SENIOR",null,"LÓPEZ DE LEÓN","ALONSO","ALONSO LÓPEZ DE LEÓN","77134342R","1997-07-05",1997,28,7,null,"2025-01-03",null,null,null,null,null,null,null,null,null,null,null,null,null,null,null,null,null,null,null,null,null,null,null,null,null,null,null,null,null,null,null,null,null,null,null,null,null,null,null,null,null,null,null,null,null,0,0]
[0,0,0,0,0,0,0,0,"SENIOR",null,"MORELLA BARREDA","ÁLVARO","ÁLVARO MORELLA BARREDA","73023479C","1997-06-16",1997,28,6,null,"2025-01-03",null,null,null,null,null,null,null,null,null,null,null,null,null,null,null,null,null,null,null,null,null,null,null,null,null,null,null,null,null,null,null,null,null,null,null,null,null,null,null,null,null,null,null,null,null,0,0]
[0,0,0,0,0,0,0,0,"SENIOR",null,"ALGUERÓ NADAL","ANA","ANA ALGUERÓ NADAL","73108456N","1995-06-25",1995,30,6,null,"2025-01-03",null,null,null,null,null,null,null,null,null,null,null,null,null,null,null,null,null,null,null,null,null,null,null,null,null,null,null,null,null,null,null,null,null,null,null,null,null,null,null,null,null,null,null,null,null,0,0]
[0,0,0,0,0,0,0,0,"VETERANO",null,"ARNAIZ LÓPEZ","ANA","ANA ARNAIZ LÓPEZ","47494541R","1985-07-27",1985,40,7,null,"2025-01-03",null,null,null,null,null,null,null,null,null,null,null,null,null,null,null,null,null,null,null,null,null,null,null,null,null,null,null,null,null,null,null,null,null,null,null,null,null,null,null,null,null,null,null,null,null,0,0]
[0,0,0,0,0,0,0,0,"VETERANO",null,"FUENTES LORENTE","ANA CARMEN","ANA CARMEN FUENTES LORENTE","25452351E","1971-01-24",1971,54,1,null,"2025-01-03",null,null,null,null,null,null,null,null,null,null,null,null,null,null,null,null,null,null,null,null,null,null,null,null,null,null,null,null,null,null,null,null,null,null,null,null,null,null,null,null,null,null,null,null,null,0,0]
[0,0,0,0,0,0,0,0,"VETERANO",null,"ARAGÜÉS GRIEGO","ANA MARÍA","ANA MARÍA ARAGÜÉS GRIEGO","17726145E","1968-05-26",1968,57,5,null,"2025-01-03",null,null,null,null,null,null,null,null,null,null,null,null,null,null,null,null,null,null,null,null,null,null,null,null,null,null,null,null,null,null,null,null,null,null,null,null,null,null,null,null,null,null,null,null,null,0,0]
[0,0,0,0,0,0,0,0,{"$f":"IF((Q328<11),\"BENJAMIN\",IF(OR(Q328=11,Q328=12),\"ALEVIN\",IF(OR(Q328=13,Q328=14),\"INFANTIL\",IF(OR(Q328=15,Q328=16),\"CADETE\",IF(OR(Q328=17,Q328=18),\"JUVENIL\",IF(AND(Q328>18,Q328<31),\"SENIOR\",\"VETERANO\"))))))","v":"SENIOR"},null,"PEÑA ROMERO DE TEJADA","ANA","ANA PEÑA ROMERO DE TEJADA","73104554C","1999-05-30",1999,26,5,null,"2025-01-03",null,null,null,null,null,null,null,null,null,null,null,null,null,null,null,null,null,null,null,null,null,null,null,null,null,null,null,null,null,null,null,null,null,null,null,null,null,null,null,null,null,null,null,null,null,0,0]
[0,0,0,0,0,0,0,0,"JUVENIL",null,"CATALÁN MONTULL","ANAIS","ANAIS CATALÁN MONTULL","48253486S","2007-01-31",2007,18,1,null,"2025-01-03",null,null,null,null,null,null,null,null,null,null,null,null,null,null,null,null,null,null,null,null,null,null,null,null,null,null,null,null,null,null,null,null,null,null,null,null,null,null,null,null,null,null,null,null,null,0,0]
[0,0,0,0,0,0,0,0,"SENIOR",null,"PUEYO DIARTE","ÁNGEL","ÁNGEL PUEYO DIARTE","73013020A","1998-01-03",1998,27,1,null,"2025-01-03",null,null,null,null,null,null,null,null,null,null,null,null,null,null,null,null,null,null,null,null,null,null,null,null,null,null,null,null,null,null,null,null,null,null,null,null,null,null,null,null,null,null,null,null,null,0,0]
[0,0,0,0,0,0,0,0,"VETERANO",null,"SÁNCHEZ SÁNCHEZ","ÁNGEL",{"$f":"L331&\" \"& K331","v":"ÁNGEL SÁNCHEZ SÁNCHEZ"},"17160911J","1963-02-23",{"$f":"YEAR(O331)","v":1963},62,{"$f":"MONTH(O331)","v":2},null,"2025-01-03",null,null,null,null,null,null,null,null,null,null,null,null,null,null,null,null,null,null,null,null,null,null,null,null,null,null,null,null,null,null,null,null,null,null,null,null,null,null,null,null,null,null,null,null,null,0,0]
[0,0,0,0,0,0,0,0,"SENIOR",null,"OLIVA CORTÉS","ÁNGELA","ÁNGELA OLIVA CORTÉS","73236459C","2006-07-22",2006,19,7,null,"2025-01-03",null,null,null,null,null,null,null,null,null,null,null,null,null,null,null,null,null,null,null,null,null,null,null,null,null,null,null,null,null,null,null,null,null,null,null,null,null,null,null,null,null,null,null,null,null,0,0]
[0,0,0,0,0,0,0,0,"SENIOR",null,"ALMUDÉVAR ATIENZA","ANTONIO","ANTONIO ALMUDÉVAR ATIENZA","25204448J","1998-10-28",1998,27,10,null,"2025-01-03",null,null,null,null,null,null,null,null,null,null,null,null,null,null,null,null,null,null,null,null,null,null,null,null,null,null,null,null,null,null,null,null,null,null,null,null,null,null,null,null,null,null,null,null,null,0,0]
[0,0,0,0,0,0,0,0,"SENIOR",null,"SANJUÁN VERA","ARIADNA","ARIADNA SANJUÁN VERA","73106286G","1999-08-10",1999,26,8,null,"2025-01-03",null,null,null,null,null,null,null,null,null,null,null,null,null,null,null,null,null,null,null,null,null,null,null,null,null,null,null,null,null,null,null,null,null,null,null,null,null,null,null,null,null,null,null,null,null,0,0]
[0,0,0,0,0,0,0,0,"VETERANO",null,"VERGÉ TORRES","ARTURO","ARTURO VERGÉ TORRES","47681061Z","1983-10-05",1983,42,10,null,"2025-01-03",null,null,null,null,null,null,null,null,null,null,null,null,null,null,null,null,null,null,null,null,null,null,null,null,null,null,null,null,null,null,null,null,null,null,null,null,null,null,null,null,null,null,null,null,null,0,0]
[0,0,0,0,0,0,0,0,"SENIOR",null,"LEFKOFF","ASHER","ASHER LEFKOFF",666901177,"2005-08-19",2005,20,8,null,"2025-01-03",null,null,null,null,null,null,null,null,null,null,null,null,null,null,null,null,null,null,null,null,null,null,null,null,null,null,null,null,null,null,null,null,null,null,null,null,null,null,null,null,null,null,null,null,null,0,0]
[0,0,0,0,0,0,0,0,"CADETE",null,"ESTRADA ROLDÁN","AUDALD","AUDALD ESTRADA ROLDÁN","48280528D","2009-07-07",2009,16,7,null,"2025-01-03",null,null,null,null,null,null,null,null,null,null,null,null,null,null,null,null,null,null,null,null,null,null,null,null,null,null,null,null,null,null,null,null,null,null,null,null,null,null,null,null,null,null,null,null,null,0,0]
[0,0,0,0,0,0,0,0,"JUVENIL",null,"ROCA VENTURA","ÁXEL","ÁXEL ROCA VENTURA","48158216B","2007-09-15",2007,18,9,null,"2025-01-03",null,null,null,null,null,null,null,null,null,null,null,null,null,null,null,null,null,null,null,null,null,null,null,null,null,null,null,null,null,null,null,null,null,null,null,null,null,null,null,null,null,null,null,null,null,0,0]
[0,0,0,0,0,0,0,0,"VETERANO",null,"CARNICER LISO","BEATRIZ","BEATRIZ CARNICER LISO","76921108T","1985-03-12",1985,40,3,null,"2025-01-03",null,null,null,null,null,null,null,null,null,null,null,null,null,null,null,null,null,null,null,null,null,null,null,null,null,null,null,null,null,null,null,null,null,null,null,null,null,null,null,null,null,null,null,null,null,0,0]
[0,0,0,0,0,0,0,0,"SENIOR",null,"PÉREZ VÁZQUEZ","BELTRÁN","BELTRÁN PÉREZ VÁZQUEZ","73514244B","2006-07-18",2006,19,7,null,"2025-01-03",null,null,null,null,null,null,null,null,null,null,null,null,null,null,null,null,null,null,null,null,null,null,null,null,null,null,null,null,null,null,null,null,null,null,null,null,null,null,null,null,null,null,null,null,null,0,0]
[0,0,0,0,0,0,0,0,"SENIOR",null,"HERRERO GARCÍA","BRUNO","BRUNO HERRERO GARCÍA","73053513Q","1999-06-26",1999,26,6,null,"2025-01-03",null,null,null,null,null,null,null,null,null,null,null,null,null,null,null,null,null,null,null,null,null,null,null,null,null,null,null,null,null,null,null,null,null,null,null,null,null,null,null,null,null,null,null,null,null,0,0]
[0,0,0,0,0,0,0,0,"JUVENIL",null,"KOLLMANNSBERGER MARCÉN","BRUNO","BRUNO KOLLMANNSBERGER MARCÉN","25356468A","2008-11-03",2008,17,11,null,"2025-01-03",null,null,null,null,null,null,null,null,null,null,null,null,null,null,null,null,null,null,null,null,null,null,null,null,null,null,null,null,null,null,null,null,null,null,null,null,null,null,null,null,null,null,null,null,null,0,0]
[0,0,0,0,0,0,0,0,"ALEVIN",null,"BERENGUER SAGARRA","CARE","CARE BERENGUER SAGARRA","09826636R","2013-09-23",2013,12,9,null,"2025-01-03",null,null,null,null,null,null,null,null,null,null,null,null,null,null,null,null,null,null,null,null,null,null,null,null,null,null,null,null,null,null,null,null,null,null,null,null,null,null,null,null,null,null,null,null,null,0,0]
[0,0,0,0,0,0,0,0,"JUVENIL",null,"AURED CARBI","CARLA","CARLA AURED CARBI","73439677X","2008-05-06",2008,17,5,null,"2025-01-03",null,null,null,null,null,null,null,null,null,null,null,null,null,null,null,null,null,null,null,null,null,null,null,null,null,null,null,null,null,null,null,null,null,null,null,null,null,null,null,null,null,null,null,null,null,0,0]
[0,0,0,0,0,0,0,0,"SENIOR",null,"MARTÍNEZ MINGUILLÓN","CARLA","CARLA MARTÍNEZ MINGUILLÓN","25364238E","1996-04-04",1996,29,4,null,"2025-01-03",null,null,null,null,null,null,null,null,null,null,null,null,null,null,null,null,null,null,null,null,null,null,null,null,null,null,null,null,null,null,null,null,null,null,null,null,null,null,null,null,null,null,null,null,null,0,0]
[0,0,0,0,0,0,0,0,"CADETE",null,"TORRES GODIA","CARLA","CARLA TORRES GODIA","49758958V","2009-08-30",2009,16,8,null,"2025-01-03",null,null,null,null,null,null,null,null,null,null,null,null,null,null,null,null,null,null,null,null,null,null,null,null,null,null,null,null,null,null,null,null,null,null,null,null,null,null,null,null,null,null,null,null,null,0,0]
[0,0,0,0,0,0,0,0,"VETERANO",null,"MUNIESA FERRERO","CARLOS ALBERTO","CARLOS ALBERTO MUNIESA FERRERO","17707468K","1962-02-02",1962,63,2,null,"2025-01-03",null,null,null,null,null,null,null,null,null,null,null,null,null,null,null,null,null,null,null,null,null,null,null,null,null,null,null,null,null,null,null,null,null,null,null,null,null,null,null,null,null,null,null,null,null,0,0]
[0,0,0,0,0,0,0,0,"SENIOR",null,"ALONSO GUTIÉRREZ","CARLOS","CARLOS ALONSO GUTIÉRREZ","77223685N","2006-07-16",2006,19,7,null,"2025-01-03",null,null,null,null,null,null,null,null,null,null,null,null,null,null,null,null,null,null,null,null,null,null,null,null,null,null,null,null,null,null,null,null,null,null,null,null,null,null,null,null,null,null,null,null,null,0,0]
[0,0,0,0,0,0,0,0,"VETERANO",null,"ROCA ESTEVE","CARLOS ANDRES","CARLOS ANDRES ROCA ESTEVE","73154337P","1966-08-10",1966,59,8,null,"2025-01-03",null,null,null,null,null,null,null,null,null,null,null,null,null,null,null,null,null,null,null,null,null,null,null,null,null,null,null,null,null,null,null,null,null,null,null,null,null,null,null,null,null,null,null,null,null,0,0]
[0,0,0,0,0,0,0,0,"VETERANO",null,"FERRER MÍNGUEZ","CARLOS","CARLOS FERRER MÍNGUEZ","17741699M","1977-02-01",1977,48,2,null,"2025-01-03",null,null,null,null,null,null,null,null,null,null,null,null,null,null,null,null,null,null,null,null,null,null,null,null,null,null,null,null,null,null,null,null,null,null,null,null,null,null,null,null,null,null,null,null,null,0,0]
[0,0,0,0,0,0,0,0,"VETERANO",null,"MELGARES HIDALGO","CARLOS","CARLOS MELGARES HIDALGO","17695224J","1956-12-31",1956,69,12,null,"2025-01-03",null,null,null,null,null,null,null,null,null,null,null,null,null,null,null,null,null,null,null,null,null,null,null,null,null,null,null,null,null,null,null,null,null,null,null,null,null,null,null,null,null,null,null,null,null,0,0]
[0,0,0,0,0,0,0,0,"SENIOR",null,"PONCE USÓN","CARLOS","CARLOS PONCE USÓN","25207175A","2002-10-19",2002,23,10,null,"2025-01-03",null,null,null,null,null,null,null,null,null,null,null,null,null,null,null,null,null,null,null,null,null,null,null,null,null,null,null,null,null,null,null,null,null,null,null,null,null,null,null,null,null,null,null,null,null,0,0]
[0,0,0,0,0,0,0,0,"VETERANO",null,"ROCA ESTEVE","CARLOS","CARLOS ROCA ESTEVE","73154337P","1966-08-10",1966,59,8,null,"2025-01-03",null,null,null,null,null,null,null,null,null,null,null,null,null,null,null,null,null,null,null,null,null,null,null,null,null,null,null,null,null,null,null,null,null,null,null,null,null,null,null,null,null,null,null,null,null,0,0]
[0,0,0,0,0,0,0,0,"VETERANO",null,"GÁLVEZ ARIAS","CARMEN","CARMEN GÁLVEZ ARIAS","25458065D","1971-12-07",1971,54,12,null,"2025-01-03",null,null,null,null,null,null,null,null,null,null,null,null,null,null,null,null,null,null,null,null,null,null,null,null,null,null,null,null,null,null,null,null,null,null,null,null,null,null,null,null,null,null,null,null,null,0,0]
[0,0,0,0,0,0,0,0,"VETERANO",null,"YILMAZ","CENGIZ","CENGIZ YILMAZ","09828299P","1989-07-08",1989,36,7,null,"2025-01-03",null,null,null,null,null,null,null,null,null,null,null,null,null,null,null,null,null,null,null,null,null,null,null,null,null,null,null,null,null,null,null,null,null,null,null,null,null,null,null,null,null,null,null,null,null,0,0]
[0,0,0,0,0,0,0,0,"VETERANO",null,"JUSTE ECHEVERRÍA","CÉSAR","CÉSAR JUSTE ECHEVERRÍA","29101573H","1979-08-21",1979,46,8,null,"2025-01-03",null,null,null,null,null,null,null,null,null,null,null,null,null,null,null,null,null,null,null,null,null,null,null,null,null,null,null,null,null,null,null,null,null,null,null,null,null,null,null,null,null,null,null,null,null,0,0]
[0,0,0,0,0,0,0,0,"INFANTIL",null,"EHRET GARCÍA","CHLOÉ","CHLOÉ EHRET GARCÍA","130681102578-FR","2011-06-13",2011,14,6,null,"2025-01-03",null,null,null,null,null,null,null,null,null,null,null,null,null,null,null,null,null,null,null,null,null,null,null,null,null,null,null,null,null,null,null,null,null,null,null,null,null,null,null,null,null,null,null,null,null,0,0]
[0,0,0,0,0,0,0,0,"VETERANO",null,"KLEINGRIES FORCÉN","CHRISTIAN","CHRISTIAN KLEINGRIES FORCÉN","77223545X","1979-05-24",1979,46,5,null,"2025-01-03",null,null,null,null,null,null,null,null,null,null,null,null,null,null,null,null,null,null,null,null,null,null,null,null,null,null,null,null,null,null,null,null,null,null,null,null,null,null,null,null,null,null,null,null,null,0,0]
[0,0,0,0,0,0,0,0,"VETERANO",null,"CHARRIERE","CLAIRE","CLAIRE CHARRIERE","X192416H","1970-11-14",1970,55,11,null,"2025-01-03",null,null,null,null,null,null,null,null,null,null,null,null,null,null,null,null,null,null,null,null,null,null,null,null,null,null,null,null,null,null,null,null,null,null,null,null,null,null,null,null,null,null,null,null,null,0,0]
[0,0,0,0,0,0,0,0,"SENIOR",null,"ANDREU MARTÍN","CLARA","CLARA ANDREU MARTÍN","47480808E","2001-04-17",2001,24,4,null,"2025-01-03",null,null,null,null,null,null,null,null,null,null,null,null,null,null,null,null,null,null,null,null,null,null,null,null,null,null,null,null,null,null,null,null,null,null,null,null,null,null,null,null,null,null,null,null,null,0,0]
[0,0,0,0,0,0,0,0,"SENIOR",null,"ALCÁZAR HERRERO","CLAUDIA","CLAUDIA ALCÁZAR HERRERO","73168238V","2004-08-24",2004,21,8,null,"2025-01-03",null,null,null,null,null,null,null,null,null,null,null,null,null,null,null,null,null,null,null,null,null,null,null,null,null,null,null,null,null,null,null,null,null,null,null,null,null,null,null,null,null,null,null,null,null,0,0]
[0,0,0,0,0,0,0,0,"JUVENIL",null,"ASO LÓPEZ","CLAUDIA","CLAUDIA ASO LÓPEZ","73032358K","2008-05-07",2008,17,5,null,"2025-01-03",null,null,null,null,null,null,null,null,null,null,null,null,null,null,null,null,null,null,null,null,null,null,null,null,null,null,null,null,null,null,null,null,null,null,null,null,null,null,null,null,null,null,null,null,null,0,0]
[0,0,0,0,0,0,0,0,"SENIOR",null,"MONTILLA GALLEGO","CLAUDIA","CLAUDIA MONTILLA GALLEGO","18082142W","2000-06-13",2000,25,6,null,"2025-01-03",null,null,null,null,null,null,null,null,null,null,null,null,null,null,null,null,null,null,null,null,null,null,null,null,null,null,null,null,null,null,null,null,null,null,null,null,null,null,null,null,null,null,null,null,null,0,0]
[0,0,0,0,0,0,0,0,"VETERANO",null,"CHILLÓN RACHL","CRISTIAN","CRISTIAN CHILLÓN RACHL",null,null,1900,125,1,null,"2025-01-03",null,null,null,null,null,null,null,null,null,null,null,null,null,null,null,null,null,null,null,null,null,null,null,null,null,null,null,null,null,null,null,null,null,null,null,null,null,null,null,null,null,null,null,null,null,{"$f":"AJ364+AL364+AN364+AP364+AR364+AT364+AV364+AX364+AZ364+BB364+BD364+BF364+BH364+BJ364+BL364","v":0},0]
[{"$f":"IF(J365=\"F\", 1,0)","v":0},{"$f":"IF(I365=\"B\", 1,0)","v":0},{"$f":"IF(I365=\"A\", 1,0)","v":0},{"$f":"IF(I365=\"I\", 1,0)","v":0},{"$f":"IF(I365=\"C\", 1,0)","v":0},{"$f":"IF(I365=\"J\", 1,0)","v":0},{"$f":"IF(I365=\"S\", 1,0)","v":0},{"$f":"IF(I365=\"V\", 1,0)","v":0},"VETERANO",null,"ÁLVAREZ MORENO","CRISTINA","CRISTINA ÁLVAREZ MORENO","73134552Y","1994-11-25",1994,{"$f":"$Y$1-P365","v":31},11,null,"2025-01-03",null,null,null,null,null,null,null,null,null,null,null,null,null,null,null,null,null,null,null,null,null,null,null,null,null,null,null,null,null,null,null,null,null,null,null,null,null,null,null,null,null,null,null,null,null,0,0]
[0,0,0,0,0,0,0,0,"VETERANO",null,"SANDE CECCHI","CRISTINA","CRISTINA SANDE CECCHI","10864899K","1969-05-01",1969,56,5,null,"2025-01-03",null,null,null,null,null,null,null,null,null,null,null,null,null,null,null,null,null,null,null,null,null,null,null,null,null,null,null,null,null,null,null,null,null,null,null,null,null,null,null,null,null,null,null,null,null,0,0]
[0,0,0,0,0,0,0,0,"VETERANO",null,"VERA ARÁN","CRISTINA","CRISTINA VERA ARÁN","73157370M","1976-06-14",1976,49,6,null,"2025-01-03",null,null,null,null,null,null,null,null,null,null,null,null,null,null,null,null,null,null,null,null,null,null,null,null,null,null,null,null,null,null,null,null,null,null,null,null,null,null,null,null,null,null,null,null,null,0,0]
[0,0,0,0,0,0,0,0,"JUVENIL",null,"ZAPATA LARROY","DANIEL ARTURO","DANIEL ARTURO ZAPATA LARROY","25357360K","2007-12-09",2007,18,12,null,"2025-01-03",null,null,null,null,null,null,null,null,null,null,null,null,null,null,null,null,null,null,null,null,null,null,null,null,null,null,null,null,null,null,null,null,null,null,null,null,null,null,null,null,null,null,null,null,null,0,0]
[0,0,0,0,0,0,0,0,"VETERANO",null,"GALE LECHÓN","DANIEL","DANIEL GALE LECHÓN","73001191L","1987-09-17",1987,38,9,null,"2025-01-03",null,null,null,null,null,null,null,null,null,null,null,null,null,null,null,null,null,null,null,null,null,null,null,null,null,null,null,null,null,null,null,null,null,null,null,null,null,null,null,null,null,null,null,null,null,0,0]
[0,0,0,0,0,0,0,0,"VETERANO",null,"SANTAMARÍA GARCÍA DE JALÓN","DANIEL JOAQUÍN","DANIEL JOAQUÍN SANTAMARÍA GARCÍA DE JALÓN","25457884N","1972-01-06",1972,53,1,null,"2025-01-03",null,null,null,null,null,null,null,null,null,null,null,null,null,null,null,null,null,null,null,null,null,null,null,null,null,null,null,null,null,null,null,null,null,null,null,null,null,null,null,null,null,null,null,null,null,0,0]
[0,0,0,0,0,0,0,0,"JUVENIL",null,"VELILLA PÉREZ","DANIEL","DANIEL VELILLA PÉREZ","73285521T","2008-07-19",2008,17,7,null,"2025-01-03",null,null,null,null,null,null,null,null,null,null,null,null,null,null,null,null,null,null,null,null,null,null,null,null,null,null,null,null,null,null,null,null,null,null,null,null,null,null,null,null,null,null,null,null,null,0,0]
[0,0,0,0,0,0,0,0,"SENIOR",null,"SOLONETS","DANIIL","DANIIL SOLONETS","Y9529321K","2004-11-08",2004,21,11,null,"2025-01-03",null,null,null,null,null,null,null,null,null,null,null,null,null,null,null,null,null,null,null,null,null,null,null,null,null,null,null,null,null,null,null,null,null,null,null,null,null,null,null,null,null,null,null,null,null,0,0]
[0,0,0,0,0,0,0,0,"VETERANO",null,"MILLÁN GUÍU","DARÍO","DARÍO MILLÁN GUÍU","25193631Y","1994-03-13",1994,31,3,null,"2025-01-03",null,null,null,null,null,null,null,null,null,null,null,null,null,null,null,null,null,null,null,null,null,null,null,null,null,null,null,null,null,null,null,null,null,null,null,null,null,null,null,null,null,null,null,null,null,0,0]
[0,0,0,0,0,0,0,0,"SENIOR",null,"DÍEZ IBÁÑEZ","DAVID","DAVID DÍEZ IBÁÑEZ","17767673N","1995-07-09",1995,30,7,null,"2025-01-03",null,null,null,null,null,null,null,null,null,null,null,null,null,null,null,null,null,null,null,null,null,null,null,null,null,null,null,null,null,null,null,null,null,null,null,null,null,null,null,null,null,null,null,null,null,0,0]
[0,0,0,0,0,0,0,0,"SENIOR",null,"MARTÍNEZ TORRES","DAVID","DAVID MARTÍNEZ TORRES","73132655S","2004-06-18",2004,21,6,null,"2025-01-03",null,null,null,null,null,null,null,null,null,null,null,null,null,null,null,null,null,null,null,null,null,null,null,null,null,null,null,null,null,null,null,null,null,null,null,null,null,null,null,null,null,null,null,null,null,0,0]
[0,0,0,0,0,0,0,0,"SENIOR",null,"NUÑO PARACUELLOS","DAVID","DAVID NUÑO PARACUELLOS","73055421S","2001-05-05",2001,24,5,null,"2025-01-03",null,null,null,null,null,null,null,null,null,null,null,null,null,null,null,null,null,null,null,null,null,null,null,null,null,null,null,null,null,null,null,null,null,null,null,null,null,null,null,null,null,null,null,null,null,0,0]
[0,0,0,0,0,0,0,0,"VETERANO",null,"TORO SOLER","DAVID","DAVID TORO SOLER","76922443R","1985-07-18",1985,40,7,null,"2025-01-03",null,null,null,null,null,null,null,null,null,null,null,null,null,null,null,null,null,null,null,null,null,null,null,null,null,null,null,null,null,null,null,null,null,null,null,null,null,null,null,null,null,null,null,null,null,0,0]
[0,0,0,0,0,0,0,0,"JUVENIL",null,"FERNÁNDEZ DELGADO","DENIS","DENIS FERNÁNDEZ DELGADO",null,"2007-11-21",2007,18,11,null,"2025-01-03",null,null,null,null,null,null,null,null,null,null,null,null,null,null,null,null,null,null,null,null,null,null,null,null,null,null,null,null,null,null,null,null,null,null,null,null,null,null,null,null,null,null,null,null,null,0,0]
[0,0,0,0,0,0,0,0,"SENIOR",null,"BLASCO GIMENO","DIEGO","DIEGO BLASCO GIMENO","73052825H","1998-06-09",1998,27,6,null,"2025-01-03",null,null,null,null,null,null,null,null,null,null,null,null,null,null,null,null,null,null,null,null,null,null,null,null,null,null,null,null,null,null,null,null,null,null,null,null,null,null,null,null,null,null,null,null,null,0,0]
[0,0,0,0,0,0,0,0,"SENIOR",null,"LASHERAS BLASCO","DIEGO","DIEGO LASHERAS BLASCO","77760320B","2002-11-15",2002,23,11,null,"2025-01-03",null,null,null,null,null,null,null,null,null,null,null,null,null,null,null,null,null,null,null,null,null,null,null,null,null,null,null,null,null,null,null,null,null,null,null,null,null,null,null,null,null,null,null,null,null,0,0]
[0,0,0,0,0,0,0,0,"VETERANO",null,"SANCHEZ MIGUEL","DIEGO","DIEGO SANCHEZ MIGUEL","46756416S","1969-01-23",1969,56,1,null,"2025-01-03",null,null,null,null,null,null,null,null,null,null,null,null,null,null,null,null,null,null,null,null,null,null,null,null,null,null,null,null,null,null,null,null,null,null,null,null,null,null,null,null,null,null,null,null,null,0,0]
[0,0,0,0,0,0,0,0,"JUVENIL",null,"VALERO BOLEA","DIEGO","DIEGO VALERO BOLEA","73440012T","2008-10-03",2008,17,10,null,"2025-01-03",null,null,null,null,null,null,null,null,null,null,null,null,null,null,null,null,null,null,null,null,null,null,null,null,null,null,null,null,null,null,null,null,null,null,null,null,null,null,null,null,null,null,null,null,null,0,0]
[0,0,0,0,0,0,0,0,"SENIOR",null,"VELA JULIÁN","DIEGO","DIEGO VELA JULIÁN","75439179H","2002-07-03",2002,23,7,null,"2025-01-03",null,null,null,null,null,null,null,null,null,null,null,null,null,null,null,null,null,null,null,null,null,null,null,null,null,null,null,null,null,null,null,null,null,null,null,null,null,null,null,null,null,null,null,null,null,0,0]
[0,0,0,0,0,0,0,0,"ALEVIN",null,"GARÍ MURILLO","EDGAR","EDGAR GARÍ MURILLO","NO TIENE","2013-09-05",2013,12,9,null,"2025-01-03",null,null,null,null,null,null,null,null,null,null,null,null,null,null,null,null,null,null,null,null,null,null,null,null,null,null,null,null,null,null,null,null,null,null,null,null,null,null,null,null,null,null,null,null,null,0,0]
[0,0,0,0,0,0,0,0,"INFANTIL",null,"SANTANA IBARZ","EDGAR","EDGAR SANTANA IBARZ","06670280G","2011-12-13",2011,14,12,null,"2025-01-03",null,null,null,null,null,null,null,null,null,null,null,null,null,null,null,null,null,null,null,null,null,null,null,null,null,null,null,null,null,null,null,null,null,null,null,null,null,null,null,null,null,null,null,null,null,0,0]
[0,0,0,0,0,0,0,0,"SENIOR",null,"MORELLA BARREDA","EDUARDO","EDUARDO MORELLA BARREDA","73023480K","1998-12-01",1998,27,12,null,"2025-01-03",null,null,null,null,null,null,null,null,null,null,null,null,null,null,null,null,null,null,null,null,null,null,null,null,null,null,null,null,null,null,null,null,null,null,null,null,null,null,null,null,null,null,null,null,null,0,0]
[0,0,0,0,0,0,0,0,"ALEVIN",null,"CATALÁN LLOP","EFRÉN","EFRÉN CATALÁN LLOP","09826494C","2013-09-05",2013,12,9,null,"2025-01-03",null,null,null,null,null,null,null,null,null,null,null,null,null,null,null,null,null,null,null,null,null,null,null,null,null,null,null,null,null,null,null,null,null,null,null,null,null,null,null,null,null,null,null,null,null,0,0]
[0,0,0,0,0,0,0,0,"SENIOR",null,"PÉREZ MORENO","EIDER","EIDER PÉREZ MORENO","26606276Z","2006-09-07",2006,19,9,null,"2025-01-03",null,null,null,null,null,null,null,null,null,null,null,null,null,null,null,null,null,null,null,null,null,null,null,null,null,null,null,null,null,null,null,null,null,null,null,null,null,null,null,null,null,null,null,null,null,0,0]
[0,0,0,0,0,0,0,0,"JUVENIL",null,"MARTÍNEZ TORRES","ELENA","ELENA MARTÍNEZ TORRES","77221052R","2008-02-29",2008,17,2,null,"2025-01-03",null,null,null,null,null,null,null,null,null,null,null,null,null,null,null,null,null,null,null,null,null,null,null,null,null,null,null,null,null,null,null,null,null,null,null,null,null,null,null,null,null,null,null,null,null,0,0]
[0,0,0,0,0,0,0,0,"VETERANO",null,"BRAVO VIÑUALES","ELISA","ELISA BRAVO VIÑUALES","25204203K","1994-07-05",1994,31,7,null,"2025-01-03",null,null,null,null,null,null,null,null,null,null,null,null,null,null,null,null,null,null,null,null,null,null,null,null,null,null,null,null,null,null,null,null,null,null,null,null,null,null,null,null,null,null,null,null,null,0,0]
[0,0,0,0,0,0,0,0,"INFANTIL",null,"BLAS SORO","ELOY","ELOY BLAS SORO","09825446F","2011-03-23",2011,14,3,null,"2025-01-03",null,null,null,null,null,null,null,null,null,null,null,null,null,null,null,null,null,null,null,null,null,null,null,null,null,null,null,null,null,null,null,null,null,null,null,null,null,null,null,null,null,null,null,null,null,0,0]
[0,0,0,0,0,0,0,0,{"$f":"IF((Q392<11),\"BENJAMIN\",IF(OR(Q392=11,Q392=12),\"ALEVIN\",IF(OR(Q392=13,Q392=14),\"INFANTIL\",IF(OR(Q392=15,Q392=16),\"CADETE\",IF(OR(Q392=17,Q392=18),\"JUVENIL\",IF(AND(Q392>18,Q392<31),\"SENIOR\",\"VETERANO\"))))))","v":"SENIOR"},null,"GARCÉS LÓPEZ","EMMA","EMMA GARCÉS LÓPEZ","77219451X","1998-04-22",1998,27,4,null,"2025-01-03",null,null,null,null,null,null,null,null,null,null,null,null,null,null,null,null,null,null,null,null,null,null,null,null,null,null,null,null,null,null,null,null,null,null,null,null,null,null,null,null,null,null,null,null,null,0,0]
[0,0,0,0,0,0,0,0,"VETERANO",null,"MARTÍNEZ SOLA","ENCARNA ","ENCARNA  MARTÍNEZ SOLA","73155624F","1968-02-27",1968,57,2,null,"2025-01-03",null,null,null,null,null,null,null,null,null,null,null,null,null,null,null,null,null,null,null,null,null,null,null,null,null,null,null,null,null,null,null,null,null,null,null,null,null,null,null,null,null,null,null,null,null,0,0]
[0,0,0,0,0,0,0,0,"JUVENIL",null,"BERENGUER UTRILLA","ENRIQUE","ENRIQUE BERENGUER UTRILLA","09826096J","2007-09-13",2007,18,9,null,"2025-01-03",null,null,null,null,null,null,null,null,null,null,null,null,null,null,null,null,null,null,null,null,null,null,null,null,null,null,null,null,null,null,null,null,null,null,null,null,null,null,null,null,null,null,null,null,null,0,0]
[0,0,0,0,0,0,0,0,"SENIOR",null,"ESTEVE NEVADO","ERIC",{"$f":"L395&\" \"& K395","v":"ERIC ESTEVE NEVADO"},"73108467T","2006-11-08",{"$f":"YEAR(O395)","v":2006},19,{"$f":"MONTH(O395)","v":11},null,"2025-01-03",null,null,null,null,null,null,null,null,null,null,null,null,null,null,null,null,null,null,null,null,null,null,null,null,null,null,null,null,null,null,null,null,null,null,null,null,null,null,null,null,null,null,null,null,null,0,0]
[0,0,0,0,0,0,0,0,"INFANTIL",null,"CUCHI PEÑALVER","ERIK","ERIK CUCHI PEÑALVER","21748352N","2011-11-21",2011,14,11,null,"2025-01-03",null,null,null,null,null,null,null,null,null,null,null,null,null,null,null,null,null,null,null,null,null,null,null,null,null,null,null,null,null,null,null,null,null,null,null,null,null,null,null,null,null,null,null,null,null,0,0]
[0,0,0,0,0,0,0,0,"VETERANO",null,"SÁNCHEZ GARRIGÓS","ERNESTO","ERNESTO SÁNCHEZ GARRIGÓS","48619794W","1992-11-04",1992,33,11,null,"2025-01-03",null,null,null,null,null,null,null,null,null,null,null,null,null,null,null,null,null,null,null,null,null,null,null,null,null,null,null,null,null,null,null,null,null,null,null,null,null,null,null,null,null,null,null,null,null,0,0]
[0,0,0,0,0,0,0,0,"SENIOR",null,"BRIZ ZAMORANO","ESTHER","ESTHER BRIZ ZAMORANO","17768135Z","2000-01-31",2000,25,1,null,"2025-01-03",null,null,null,null,null,null,null,null,null,null,null,null,null,null,null,null,null,null,null,null,null,null,null,null,null,null,null,null,null,null,null,null,null,null,null,null,null,null,null,null,null,null,null,null,null,0,0,1]
[0,0,0,0,0,0,0,0,"CADETE",null,"BENAMAR","ETHAN NADIR","ETHAN NADIR BENAMAR","200781150610FR","2010-06-01",2010,15,6,null,"2025-01-03",null,null,null,null,null,null,null,null,null,null,null,null,null,null,null,null,null,null,null,null,null,null,null,null,null,null,null,null,null,null,null,null,null,null,null,null,null,null,null,null,null,null,null,null,null,0,0]
[0,0,0,0,0,0,0,0,"VETERANO",null,"SANAGUA ORGÁ","FACUNDO","FACUNDO SANAGUA ORGÁ","55503153J","1989-06-11",1989,36,6,null,"2025-01-03",null,null,null,null,null,null,null,null,null,null,null,null,null,null,null,null,null,null,null,null,null,null,null,null,null,null,null,null,null,null,null,null,null,null,null,null,null,null,null,null,null,null,null,null,null,0,0]
[0,0,0,0,0,0,0,0,"VETERANO",null,"AZNAR INFANTE","FERNANDO","FERNANDO AZNAR INFANTE","17150330N","1960-06-05",1960,65,6,null,"2025-01-03",null,null,null,null,null,null,null,null,null,null,null,null,null,null,null,null,null,null,null,null,null,null,null,null,null,null,null,null,null,null,null,null,null,null,null,null,null,null,null,null,null,null,null,null,null,0,0]
[0,0,0,0,0,0,0,0,"SENIOR",null,"GARCÍA CEITEGUI","FERNANDO","FERNANDO GARCÍA CEITEGUI","73440493K","2001-09-13",2001,24,9,null,"2025-01-03",null,null,null,null,null,null,null,null,null,null,null,null,null,null,null,null,null,null,null,null,null,null,null,null,null,null,null,null,null,null,null,null,null,null,null,null,null,null,null,null,null,null,null,null,null,0,0]
[0,0,0,0,0,0,0,0,"VETERANO",null,"ANTORÁN MARTÍN","FRANCISCO","FRANCISCO ANTORÁN MARTÍN","25186817t","1991-06-11",{"$f":"YEAR(O403)","v":1991},34,{"$f":"MONTH(O403)","v":6},null,"2025-01-03",null,null,null,null,null,null,null,null,null,null,null,null,null,null,null,null,null,null,null,null,null,null,null,null,null,null,null,null,null,null,null,null,null,null,null,null,null,null,null,null,null,null,null,null,null,0,0]
[0,0,0,0,0,0,0,0,"VETERANO",null,"ESCARTÍN GUERRERO","FRANCISCO","FRANCISCO ESCARTÍN GUERRERO","17205693Z","1959-12-16",1959,66,12,null,"2025-01-03",null,null,null,null,null,null,null,null,null,null,null,null,null,null,null,null,null,null,null,null,null,null,null,null,null,null,null,null,null,null,null,null,null,null,null,null,null,null,null,null,null,null,null,null,null,0,0]
[0,0,0,0,0,0,0,0,"VETERANO",null,"HERNÁNDEZ RODRÍGUEZ","FRANCISCO","FRANCISCO HERNÁNDEZ RODRÍGUEZ","17140975H","1957-01-03",1957,68,1,null,"2025-01-03",null,null,null,null,null,null,null,null,null,null,null,null,null,null,null,null,null,null,null,null,null,null,null,null,null,null,null,null,null,null,null,null,null,null,null,null,null,null,null,null,null,null,null,null,null,0,0]
[0,0,0,0,0,0,0,0,"VETERANO",null,"BORDETAS OTO","FRANCISCO JAVIER","FRANCISCO JAVIER BORDETAS OTO","25449808D","1968-10-18",1968,57,10,null,"2025-01-03",null,null,null,null,null,null,null,null,null,null,null,null,null,null,null,null,null,null,null,null,null,null,null,null,null,null,null,null,null,null,null,null,null,null,null,null,null,null,null,null,null,null,null,null,null,0,0]
[0,0,0,0,0,0,0,0,"JUVENIL",null,"LAPLANA DÍAZ","GABRIELA","GABRIELA LAPLANA DÍAZ","73514302T","2007-03-07",2007,18,3,null,"2025-01-03",null,null,null,null,null,null,null,null,null,null,null,null,null,null,null,null,null,null,null,null,null,null,null,null,null,null,null,null,null,null,null,null,null,null,null,null,null,null,null,null,null,null,null,null,null,0,0]
[0,0,0,0,0,0,0,0,"VETERANO",null,"MANZANARES GÓMEZ","GABRIELA","GABRIELA MANZANARES GÓMEZ",null,null,1900,125,1,null,"2025-01-03",null,null,null,null,null,null,null,null,null,null,null,null,null,null,null,null,null,null,null,null,null,null,null,null,null,null,null,null,null,null,null,null,null,null,null,null,null,null,null,null,null,null,null,null,null,0,0]
[0,0,0,0,0,0,0,0,"SENIOR",null,"ATKIN","GEORGE","GEORGE ATKIN",647205311,"2006-06-22",2006,19,6,null,"2025-01-03",null,null,null,null,null,null,null,null,null,null,null,null,null,null,null,null,null,null,null,null,null,null,null,null,null,null,null,null,null,null,null,null,null,null,null,null,null,null,null,null,null,null,null,null,null,0,0]
[0,0,0,0,0,0,0,0,"SENIOR",null,"TSAI BADENHOPE","GEORGIA","GEORGIA TSAI BADENHOPE",663132508,"2006-04-02",2006,19,4,null,"2025-01-03",null,null,null,null,null,null,null,null,null,null,null,null,null,null,null,null,null,null,null,null,null,null,null,null,null,null,null,null,null,null,null,null,null,null,null,null,null,null,null,null,null,null,null,null,null,0,0]
[0,0,0,0,0,0,0,0,"SENIOR",null,"LORA GRANADOS","GERARD","GERARD LORA GRANADOS","49717048H","2006-06-27",2006,19,6,null,"2025-01-03",null,null,null,null,null,null,null,null,null,null,null,null,null,null,null,null,null,null,null,null,null,null,null,null,null,null,null,null,null,null,null,null,null,null,null,null,null,null,null,null,null,null,null,null,null,0,0]
[0,0,0,0,0,0,0,0,"CADETE",null,"GUTIÉRREZ GASPAR","GERMÁN","GERMÁN GUTIÉRREZ GASPAR","26056076C","2009-07-30",2009,16,7,null,"2025-01-03",null,null,null,null,null,null,null,null,null,null,null,null,null,null,null,null,null,null,null,null,null,null,null,null,null,null,null,null,null,null,null,null,null,null,null,null,null,null,null,null,null,null,null,null,null,0,0]
[0,0,0,0,0,0,0,0,"JUVENIL",null,"MONTAGUD GÓMEZ","GONZALO","GONZALO MONTAGUD GÓMEZ","73159450S","2007-04-17",2007,18,4,null,"2025-01-03",null,null,null,null,null,null,null,null,null,null,null,null,null,null,null,null,null,null,null,null,null,null,null,null,null,null,null,null,null,null,null,null,null,null,null,null,null,null,null,null,null,null,null,null,null,0,0]
[0,0,0,0,0,0,0,0,"SENIOR",null,"ARRIZABALAGA SOLANO","GUILLERMO JAVIER","GUILLERMO JAVIER ARRIZABALAGA SOLANO","73028331L","1998-10-17",1998,27,10,null,"2025-01-03",null,null,null,null,null,null,null,null,null,null,null,null,null,null,null,null,null,null,null,null,null,null,null,null,null,null,null,null,null,null,null,null,null,null,null,null,null,null,null,null,null,null,null,null,null,0,0]
[0,0,0,0,0,0,0,0,"SENIOR",null,"MARTÍNEZ ALFRANCA","GUILLERMO","GUILLERMO MARTÍNEZ ALFRANCA","25205887A","1996-11-10",1996,29,11,null,"2025-01-03",null,null,null,null,null,null,null,null,null,null,null,null,null,null,null,null,null,null,null,null,null,null,null,null,null,null,null,null,null,null,null,null,null,null,null,null,null,null,null,null,null,null,null,null,null,0,0]
[0,0,0,0,0,0,0,0,"CADETE",null,"MALOSSO","HARDY DARCET CAMILLE","HARDY DARCET CAMILLE MALOSSO","Y9103795H","2009-09-14",2009,16,9,null,"2025-01-03",null,null,null,null,null,null,null,null,null,null,null,null,null,null,null,null,null,null,null,null,null,null,null,null,null,null,null,null,null,null,null,null,null,null,null,null,null,null,null,null,null,null,null,null,null,0,0]
[0,0,0,0,0,0,0,0,"CADETE",null,"JUSTE IBARZ","HÉCTOR","HÉCTOR JUSTE IBARZ","49263860E","2009-11-22",2009,16,11,null,"2025-01-03",null,null,null,null,null,null,null,null,null,null,null,null,null,null,null,null,null,null,null,null,null,null,null,null,null,null,null,null,null,null,null,null,null,null,null,null,null,null,null,null,null,null,null,null,null,0,0]
[0,0,0,0,0,0,0,0,"SENIOR",null,"PASCUAL BIARGE","HUGO","HUGO PASCUAL BIARGE","73429104V","2006-09-06",2006,19,9,null,"2025-01-03",null,null,null,null,null,null,null,null,null,null,null,null,null,null,null,null,null,null,null,null,null,null,null,null,null,null,null,null,null,null,null,null,null,null,null,null,null,null,null,null,null,null,null,null,null,0,0]
[0,0,0,0,0,0,0,0,"CADETE",null,"PASCUAL GRACIA","HUGO","HUGO PASCUAL GRACIA","26275003X","2010-10-30",2010,15,10,null,"2025-01-03",null,null,null,null,null,null,null,null,null,null,null,null,null,null,null,null,null,null,null,null,null,null,null,null,null,null,null,null,null,null,null,null,null,null,null,null,null,null,null,null,null,null,null,null,null,0,0]
[0,0,0,0,0,0,0,0,"CADETE",null,"MEDINA ECHEVERRÍA","IBÓN","IBÓN MEDINA ECHEVERRÍA","26308717Y","2009-09-24",2009,16,9,null,"2025-01-03",null,null,null,null,null,null,null,null,null,null,null,null,null,null,null,null,null,null,null,null,null,null,null,null,null,null,null,null,null,null,null,null,null,null,null,null,null,null,null,null,null,null,null,null,null,0,0]
[0,0,0,0,0,0,0,0,"SENIOR",null,"ALONSO ROMÁN","IGNACIO","IGNACIO ALONSO ROMÁN","73442955E","1998-11-06",1998,27,11,null,"2025-01-03",null,null,null,null,null,null,null,null,null,null,null,null,null,null,null,null,null,null,null,null,null,null,null,null,null,null,null,null,null,null,null,null,null,null,null,null,null,null,null,null,null,null,null,null,null,0,0]
[0,0,0,0,0,0,0,0,"VETERANO",null,"BELTRÁN DIESTRE","IGNACIO","IGNACIO BELTRÁN DIESTRE","17730967Z","1971-11-09",1971,54,11,null,"2025-01-03",null,null,null,null,null,null,null,null,null,null,null,null,null,null,null,null,null,null,null,null,null,null,null,null,null,null,null,null,null,null,null,null,null,null,null,null,null,null,null,null,null,null,null,null,null,0,0]
[0,0,0,0,0,0,0,0,"INFANTIL",null,"PERALTA AGUSTI","IGNASI","IGNASI PERALTA AGUSTI","49829496L","2011-11-11",2011,14,11,null,"2025-01-03",null,null,null,null,null,null,null,null,null,null,null,null,null,null,null,null,null,null,null,null,null,null,null,null,null,null,null,null,null,null,null,null,null,null,null,null,null,null,null,null,null,null,null,null,null,0,0]
[0,0,0,0,0,0,0,0,"CADETE",null,"ANGULO AZNAR","INÉS","INÉS ANGULO AZNAR","77220746V","2009-02-19",2009,16,2,null,"2025-01-03",null,null,null,null,null,null,null,null,null,null,null,null,null,null,null,null,null,null,null,null,null,null,null,null,null,null,null,null,null,null,null,null,null,null,null,null,null,null,null,null,null,null,null,null,null,0,0]
[0,0,0,0,0,0,0,0,"SENIOR",null,"ORDUNA GARCÍA","INÉS","INÉS ORDUNA GARCÍA","77221361B","2001-07-22",2001,24,7,null,"2025-01-03",null,null,null,null,null,null,null,null,null,null,null,null,null,null,null,null,null,null,null,null,null,null,null,null,null,null,null,null,null,null,null,null,null,null,null,null,null,null,null,null,null,null,null,null,null,0,0]
[0,0,0,0,0,0,0,0,"VETERANO",null,"CANTOS SIMÓN","INMACULADA","INMACULADA CANTOS SIMÓN","25155454D","1970-08-30",1970,55,8,null,"2025-01-03",null,null,null,null,null,null,null,null,null,null,null,null,null,null,null,null,null,null,null,null,null,null,null,null,null,null,null,null,null,null,null,null,null,null,null,null,null,null,null,null,null,null,null,null,null,0,0]
[0,0,0,0,0,0,0,0,"VETERANO",null,"GARCÍA SEGADO","ÍÑIGO","ÍÑIGO GARCÍA SEGADO",null,null,1900,125,1,null,"2025-01-03",null,null,null,null,null,null,null,null,null,null,null,null,null,null,null,null,null,null,null,null,null,null,null,null,null,null,null,null,null,null,null,null,null,null,null,null,null,null,null,null,null,null,null,null,null,0,0]
[0,0,0,0,0,0,0,0,"INFANTIL",null,"BOGA","IOANA","IOANA BOGA","Y3852403D","2011-12-06",2011,14,12,null,"2025-01-03",null,null,null,null,null,null,null,null,null,null,null,null,null,null,null,null,null,null,null,null,null,null,null,null,null,null,null,null,null,null,null,null,null,null,null,null,null,null,null,null,null,null,null,null,null,{"$f":"AJ428+AL428+AN428+AP428+AR428+AT428+AV428+AX428+AZ428+BB428+BD428+BF428+BH428+BJ428+BL428","v":0},0]
[{"$f":"IF(J429=\"F\", 1,0)","v":0},{"$f":"IF(I429=\"B\", 1,0)","v":0},{"$f":"IF(I429=\"A\", 1,0)","v":0},{"$f":"IF(I429=\"I\", 1,0)","v":0},{"$f":"IF(I429=\"C\", 1,0)","v":0},{"$f":"IF(I429=\"J\", 1,0)","v":0},{"$f":"IF(I429=\"S\", 1,0)","v":0},{"$f":"IF(I429=\"V\", 1,0)","v":0},"INFANTIL",null,"AMPOLLINI CUADRADO","IRENE","IRENE AMPOLLINI CUADRADO","26610151W","2011-04-27",2011,{"$f":"$Y$1-P429","v":14},4,null,"2025-01-03",null,null,null,null,null,null,null,null,null,null,null,null,null,null,null,null,null,null,null,null,null,null,null,null,null,null,null,null,null,null,null,null,null,null,null,null,null,null,null,null,null,null,null,null,null,0,0]
[0,0,0,0,0,0,0,0,"VETERANO",null,"LÓPEZ BOSQUE","IRENE","IRENE LÓPEZ BOSQUE","73019098D","1992-09-28",1992,33,9,null,"2025-01-03",null,null,null,null,null,null,null,null,null,null,null,null,null,null,null,null,null,null,null,null,null,null,null,null,null,null,null,null,null,null,null,null,null,null,null,null,null,null,null,null,null,null,null,null,null,0,0]
[0,0,0,0,0,0,0,0,"VETERANO",null,"PUSCO VICO","IRINA","IRINA PUSCO VICO","73132052X","1974-03-16",1974,51,3,null,"2025-01-03",null,null,null,null,null,null,null,null,null,null,null,null,null,null,null,null,null,null,null,null,null,null,null,null,null,null,null,null,null,null,null,null,null,null,null,null,null,null,null,null,null,null,null,null,null,0,0]
[0,0,0,0,0,0,0,0,"VETERANO",null,"CALLES CARRILLO","IRVING MOISÉS","IRVING MOISÉS CALLES CARRILLO","Y5957916X","1989-01-19",1989,36,1,null,"2025-01-03",null,null,null,null,null,null,null,null,null,null,null,null,null,null,null,null,null,null,null,null,null,null,null,null,null,null,null,null,null,null,null,null,null,null,null,null,null,null,null,null,null,null,null,null,null,0,0]
[0,0,0,0,0,0,0,0,"VETERANO",null,"SÁNCHEZ DENIS","ISABEL","ISABEL SÁNCHEZ DENIS","29096331C","1967-07-15",1967,58,7,null,"2025-01-03",null,null,null,null,null,null,null,null,null,null,null,null,null,null,null,null,null,null,null,null,null,null,null,null,null,null,null,null,null,null,null,null,null,null,null,null,null,null,null,null,null,null,null,null,null,0,0]
[0,0,0,0,0,0,0,0,"SENIOR",null,"GIL MIGUEL","ISMAEL ","ISMAEL  GIL MIGUEL","73163674F","1999-09-15",1999,26,9,null,"2025-01-03",null,null,null,null,null,null,null,null,null,null,null,null,null,null,null,null,null,null,null,null,null,null,null,null,null,null,null,null,null,null,null,null,null,null,null,null,null,null,null,null,null,null,null,null,null,0,0]
[0,0,0,0,0,0,0,0,"VETERANO",null,"URQUIRI VIDAL","ITZIAR","ITZIAR URQUIRI VIDAL","77218599D","1994-07-22",1994,31,7,null,"2025-01-03",null,null,null,null,null,null,null,null,null,null,null,null,null,null,null,null,null,null,null,null,null,null,null,null,null,null,null,null,null,null,null,null,null,null,null,null,null,null,null,null,null,null,null,null,null,0,0]
[0,0,0,0,0,0,0,0,"CADETE",null,"NAVARRO VILLACAMPA","IVÁN","IVÁN NAVARRO VILLACAMPA","21749858T","2009-05-15",2009,16,5,null,"2025-01-03",null,null,null,null,null,null,null,null,null,null,null,null,null,null,null,null,null,null,null,null,null,null,null,null,null,null,null,null,null,null,null,null,null,null,null,null,null,null,null,null,null,null,null,null,null,0,0]
[0,0,0,0,0,0,0,0,"SENIOR",null,"GIMENO FERRER","JAIME","JAIME GIMENO FERRER","77135307T","1998-05-07",1998,27,5,null,"2025-01-03",null,null,null,null,null,null,null,null,null,null,null,null,null,null,null,null,null,null,null,null,null,null,null,null,null,null,null,null,null,null,null,null,null,null,null,null,null,null,null,null,null,null,null,null,null,0,0]
[0,0,0,0,0,0,0,0,"VETERANO",null,"NOGUERO CURIEL","JAIME","JAIME NOGUERO CURIEL",null,null,1900,125,1,null,"2025-01-03",null,null,null,null,null,null,null,null,null,null,null,null,null,null,null,null,null,null,null,null,null,null,null,null,null,null,null,null,null,null,null,null,null,null,null,null,null,null,null,null,null,null,null,null,null,0,0]
[0,0,0,0,0,0,0,0,"SENIOR",null,"LOPERENA GALLEGO","JAVIER ALBERTO","JAVIER ALBERTO LOPERENA GALLEGO","77217444G","2002-10-24",2002,23,10,null,"2025-01-03",null,null,null,null,null,null,null,null,null,null,null,null,null,null,null,null,null,null,null,null,null,null,null,null,null,null,null,null,null,null,null,null,null,null,null,null,null,null,null,null,null,null,null,null,null,0,0]
[0,0,0,0,0,0,0,0,"VETERANO",null,"GARCÍA DE PABLO","JAVIER","JAVIER GARCÍA DE PABLO",null,"1978-04-11",1978,47,4,null,"2025-01-03",null,null,null,null,null,null,null,null,null,null,null,null,null,null,null,null,null,null,null,null,null,null,null,null,null,null,null,null,null,null,null,null,null,null,null,null,null,null,null,null,null,null,null,null,null,0,0]
[0,0,0,0,0,0,0,0,"VETERANO",null,"GARI ABELLA","JAVIER","JAVIER GARI ABELLA","39903882D","1983-11-10",1983,42,11,null,"2025-01-03",null,null,null,null,null,null,null,null,null,null,null,null,null,null,null,null,null,null,null,null,null,null,null,null,null,null,null,null,null,null,null,null,null,null,null,null,null,null,null,null,null,null,null,null,null,0,0]
[0,0,0,0,0,0,0,0,"VETERANO",null,"MELENDO SANJUAN","JAVIER","JAVIER MELENDO SANJUAN","40891982Y","1965-11-06",1965,60,11,null,"2025-01-03",null,null,null,null,null,null,null,null,null,null,null,null,null,null,null,null,null,null,null,null,null,null,null,null,null,null,null,null,null,null,null,null,null,null,null,null,null,null,null,null,null,null,null,null,null,0,0]
[0,0,0,0,0,0,0,0,"VETERANO",null,"PLAZA LEGIDO","JAVIER","JAVIER PLAZA LEGIDO","29128032G","1978-02-06",1978,47,2,null,"2025-01-03",null,null,null,null,null,null,null,null,null,null,null,null,null,null,null,null,null,null,null,null,null,null,null,null,null,null,null,null,null,null,null,null,null,null,null,null,null,null,null,null,null,null,null,null,null,0,0]
[0,0,0,0,0,0,0,0,"VETERANO",null,"CHIPRIANA FREIRE","JESÚS","JESÚS CHIPRIANA FREIRE","29102745V","1970-03-16",1970,55,3,null,"2025-01-03",null,null,null,null,null,null,null,null,null,null,null,null,null,null,null,null,null,null,null,null,null,null,null,null,null,null,null,null,null,null,null,null,null,null,null,null,null,null,null,null,null,null,null,null,null,0,0]
[0,0,0,0,0,0,0,0,"VETERANO",null,"LOGROÑO VISCASILLAS","JESÚS","JESÚS LOGROÑO VISCASILLAS","18026750V","1968-09-23",1968,57,9,null,"2025-01-03",null,null,null,null,null,null,null,null,null,null,null,null,null,null,null,null,null,null,null,null,null,null,null,null,null,null,null,null,null,null,null,null,null,null,null,null,null,null,null,null,null,null,null,null,null,0,0]
[0,0,0,0,0,0,0,0,"VETERANO",null,"YUS DÍEZ","JESÚS","JESÚS YUS DÍEZ","73029221N","1994-10-30",1994,31,10,null,"2025-01-03",null,null,null,null,null,null,null,null,null,null,null,null,null,null,null,null,null,null,null,null,null,null,null,null,null,null,null,null,null,null,null,null,null,null,null,null,null,null,null,null,null,null,null,null,null,0,0]
[0,0,0,0,0,0,0,0,"INFANTIL",null,"ESCALONA VILLACAMPA","JOKIN KOLDO","JOKIN KOLDO ESCALONA VILLACAMPA","21748357V","2012-04-02",2012,13,4,null,"2025-01-03",null,null,null,null,null,null,null,null,null,null,null,null,null,null,null,null,null,null,null,null,null,null,null,null,null,null,null,null,null,null,null,null,null,null,null,null,null,null,null,null,null,null,null,null,null,0,0]
[0,0,0,0,0,0,0,0,"VETERANO",null,"HIERRO PÁEZ","JORDI","JORDI HIERRO PÁEZ","39186769J","1971-01-13",1971,54,1,null,"2025-01-03",null,null,null,null,null,null,null,null,null,null,null,null,null,null,null,null,null,null,null,null,null,null,null,null,null,null,null,null,null,null,null,null,null,null,null,null,null,null,null,null,null,null,null,null,null,0,0]
[0,0,0,0,0,0,0,0,"CADETE",null,"VALLES SANJUAN","JORDI","JORDI VALLES SANJUAN","49263744K","2009-03-18",2009,16,3,null,"2025-01-03",null,null,null,null,null,null,null,null,null,null,null,null,null,null,null,null,null,null,null,null,null,null,null,null,null,null,null,null,null,null,null,null,null,null,null,null,null,null,null,null,null,null,null,null,null,0,0]
[0,0,0,0,0,0,0,0,"SENIOR",null,"CALAVIA VALDOVINOS","JORGE","JORGE CALAVIA VALDOVINOS","25204586J","1997-03-02",1997,28,3,null,"2025-01-03",null,null,null,null,null,null,null,null,null,null,null,null,null,null,null,null,null,null,null,null,null,null,null,null,null,null,null,null,null,null,null,null,null,null,null,null,null,null,null,null,null,null,null,null,null,0,0]
[0,0,0,0,0,0,0,0,"CADETE",null,"FRANCÉS VINTANED","JORGE","JORGE FRANCÉS VINTANED","73164211S","2010-08-23",2010,15,8,null,"2025-01-03",null,null,null,null,null,null,null,null,null,null,null,null,null,null,null,null,null,null,null,null,null,null,null,null,null,null,null,null,null,null,null,null,null,null,null,null,null,null,null,null,null,null,null,null,null,0,0]
[0,0,0,0,0,0,0,0,"SENIOR",null,"LITE BARÓN","JORGE","JORGE LITE BARÓN","17771289V","1999-07-07",1999,26,7,null,"2025-01-03",null,null,null,null,null,null,null,null,null,null,null,null,null,null,null,null,null,null,null,null,null,null,null,null,null,null,null,null,null,null,null,null,null,null,null,null,null,null,null,null,null,null,null,null,null,0,0]
[0,0,0,0,0,0,0,0,"SENIOR",null,"PEQUERUL SARIÑENA","JORGE","JORGE PEQUERUL SARIÑENA","17770249N","1998-03-03",1998,27,3,null,"2025-01-03",null,null,null,null,null,null,null,null,null,null,null,null,null,null,null,null,null,null,null,null,null,null,null,null,null,null,null,null,null,null,null,null,null,null,null,null,null,null,null,null,null,null,null,null,null,0,0]
[0,0,0,0,0,0,0,0,"SENIOR",null,"SEBASTIÁN NUEZ","JORGE","JORGE SEBASTIÁN NUEZ","73020357A","1995-01-27",1995,30,1,null,"2025-01-03",null,null,null,null,null,null,null,null,null,null,null,null,null,null,null,null,null,null,null,null,null,null,null,null,null,null,null,null,null,null,null,null,null,null,null,null,null,null,null,null,null,null,null,null,null,0,0]
[0,0,0,0,0,0,0,0,"VETERANO",null,"VILELLA RIAU","JOSÉ ANTONIO","JOSÉ ANTONIO VILELLA RIAU","73157013Q","1972-09-30",1972,53,9,null,"2025-01-03",null,null,null,null,null,null,null,null,null,null,null,null,null,null,null,null,null,null,null,null,null,null,null,null,null,null,null,null,null,null,null,null,null,null,null,null,null,null,null,null,null,null,null,null,null,0,0]
[0,0,0,0,0,0,0,0,{"$f":"IF((Q456<11),\"BENJAMIN\",IF(OR(Q456=11,Q456=12),\"ALEVIN\",IF(OR(Q456=13,Q456=14),\"INFANTIL\",IF(OR(Q456=15,Q456=16),\"CADETE\",IF(OR(Q456=17,Q456=18),\"JUVENIL\",IF(AND(Q456>18,Q456<31),\"SENIOR\",\"VETERANO\"))))))","v":"VETERANO"},null,"VICENTE ESCOSA","JOSÉ CARLOS","JOSÉ CARLOS VICENTE ESCOSA","17716175B","1964-09-18",1964,61,9,null,"2025-01-03",null,null,null,null,null,null,null,null,null,null,null,null,null,null,null,null,null,null,null,null,null,null,null,null,null,null,null,null,null,null,null,null,null,null,null,null,null,null,null,null,null,null,null,null,null,0,0]
[0,0,0,0,0,0,0,0,"VETERANO",null,"CARMELO RICO","JOSÉ","JOSÉ CARMELO RICO","17123634L","1950-01-20",1950,75,1,null,"2025-01-03",null,null,null,null,null,null,null,null,null,null,null,null,null,null,null,null,null,null,null,null,null,null,null,null,null,null,null,null,null,null,null,null,null,null,null,null,null,null,null,null,null,null,null,null,null,0,0]
[0,0,0,0,0,0,0,0,"VETERANO",null,"RICO MORENO","JOSÉ CARMELO","JOSÉ CARMELO RICO MORENO","17123634L","1950-01-20",1950,75,1,null,"2025-01-03",null,null,null,null,null,null,null,null,null,null,null,null,null,null,null,null,null,null,null,null,null,null,null,null,null,null,null,null,null,null,null,null,null,null,null,null,null,null,null,null,null,null,null,null,null,0,0]
[0,0,0,0,0,0,0,0,"VETERANO",null,"GODIA VIVES","JOSÉ",{"$f":"L459&\" \"& K459","v":"JOSÉ GODIA VIVES"},"73151019W","1958-12-09",1958,67,12,null,"2025-01-03",null,null,null,null,null,null,null,null,null,null,null,null,null,null,null,null,null,null,null,null,null,null,null,null,null,null,null,null,null,null,null,null,null,null,null,null,null,null,null,null,null,null,null,null,null,0,0]
[0,0,0,0,0,0,0,0,"VETERANO",null,"CALVENTE VELLOSO","JOSÉ IGNACIO","JOSÉ IGNACIO CALVENTE VELLOSO",null,"1974-08-01",1974,51,8,null,"2025-01-03",null,null,null,null,null,null,null,null,null,null,null,null,null,null,null,null,null,null,null,null,null,null,null,null,null,null,null,null,null,null,null,null,null,null,null,null,null,null,null,null,null,null,null,null,null,0,0]
[0,0,0,0,0,0,0,0,"SENIOR",null,"DUESO BELVER","JOSÉ IGNACIO","JOSÉ IGNACIO DUESO BELVER","73167580B","2002-02-14",2002,23,2,null,"2025-01-03",null,null,null,null,null,null,null,null,null,null,null,null,null,null,null,null,null,null,null,null,null,null,null,null,null,null,null,null,null,null,null,null,null,null,null,null,null,null,null,null,null,null,null,null,null,0,0]
[0,0,0,0,0,0,0,0,"SENIOR",null,"SANTA EUGENIA MERCADO","JOSÉ IGNACIO","JOSÉ IGNACIO SANTA EUGENIA MERCADO","73029877R","1996-01-13",1996,29,1,null,"2025-01-03",null,null,null,null,null,null,null,null,null,null,null,null,null,null,null,null,null,null,null,null,null,null,null,null,null,null,null,null,null,null,null,null,null,null,null,null,null,null,null,null,null,null,null,null,null,0,0]
[0,0,0,0,0,0,0,0,"JUVENIL",null,"LEAL SUÁREZ","JOSÉ JAVIER",{"$f":"L463&\" \"& K463","v":"JOSÉ JAVIER LEAL SUÁREZ"},"49166977S","2008-11-19",{"$f":"YEAR(O463)","v":2008},17,{"$f":"MONTH(O463)","v":11},null,"2025-01-03",null,null,null,null,null,null,null,null,null,null,null,null,null,null,null,null,null,null,null,null,null,null,null,null,null,null,null,null,null,null,null,null,null,null,null,null,null,null,null,null,null,null,null,null,null,0,0]
[0,0,0,0,0,0,0,0,"SENIOR",null,"LARIO MARÍN","JOSÉ","JOSÉ LARIO MARÍN","73026334T","1998-01-09",1998,27,1,null,"2025-01-03",null,null,null,null,null,null,null,null,null,null,null,null,null,null,null,null,null,null,null,null,null,null,null,null,null,null,null,null,null,null,null,null,null,null,null,null,null,null,null,null,null,null,null,null,null,0,0]
[0,0,0,0,0,0,0,0,"VETERANO",null,"CERDÁN TORCAL","JOSÉ MANUEL","JOSÉ MANUEL CERDÁN TORCAL",null,"1982-04-27",1982,43,4,null,"2025-01-03",null,null,null,null,null,null,null,null,null,null,null,null,null,null,null,null,null,null,null,null,null,null,null,null,null,null,null,null,null,null,null,null,null,null,null,null,null,null,null,null,null,null,null,null,null,0,0]
[0,0,0,0,0,0,0,0,"VETERANO",null,"IBARZ IBARZ","JOSÉ MANUEL","JOSÉ MANUEL IBARZ IBARZ","43743142V","1975-07-06",1975,50,7,null,"2025-01-03",null,null,null,null,null,null,null,null,null,null,null,null,null,null,null,null,null,null,null,null,null,null,null,null,null,null,null,null,null,null,null,null,null,null,null,null,null,null,null,null,null,null,null,null,null,0,0]
[0,0,0,0,0,0,0,0,"VETERANO",null,"RAMÓN COSIALS","JOSÉ MARÍA","JOSÉ MARÍA RAMÓN COSIALS","43718056R","1971-04-10",1971,54,4,null,"2025-01-03",null,null,null,null,null,null,null,null,null,null,null,null,null,null,null,null,null,null,null,null,null,null,null,null,null,null,null,null,null,null,null,null,null,null,null,null,null,null,null,null,null,null,null,null,null,0,0]
[0,0,0,0,0,0,0,0,"VETERANO",null,"PASTOR ASENSIO","JOSÉ","JOSÉ PASTOR ASENSIO","17181047R","1951-04-29",1951,74,4,null,"2025-01-03",null,null,null,null,null,null,null,null,null,null,null,null,null,null,null,null,null,null,null,null,null,null,null,null,null,null,null,null,null,null,null,null,null,null,null,null,null,null,null,null,null,null,null,null,null,0,0]
[0,0,0,0,0,0,0,0,"CADETE",null,"PIÑEDO TORRES","JOSÉ","JOSÉ PIÑEDO TORRES","73471537S","2010-04-04",2010,15,4,null,"2025-01-03",null,null,null,null,null,null,null,null,null,null,null,null,null,null,null,null,null,null,null,null,null,null,null,null,null,null,null,null,null,null,null,null,null,null,null,null,null,null,null,null,null,null,null,null,null,0,0]
[0,0,0,0,0,0,0,0,"VETERANO",null,"URRA LAMANA","JOXEMIEL","JOXEMIEL URRA LAMANA",null,"1970-09-16",1970,55,9,null,"2025-01-03",null,null,null,null,null,null,null,null,null,null,null,null,null,null,null,null,null,null,null,null,null,null,null,null,null,null,null,null,null,null,null,null,null,null,null,null,null,null,null,null,null,null,null,null,null,0,0]
[0,0,0,0,0,0,0,0,"SENIOR",null,"MUÑOZ LAHOZ","JUAN JOSÉ","JUAN JOSÉ MUÑOZ LAHOZ","26056479D","2005-11-17",2005,20,11,null,"2025-01-03",null,null,null,null,null,null,null,null,null,null,null,null,null,null,null,null,null,null,null,null,null,null,null,null,null,null,null,null,null,null,null,null,null,null,null,null,null,null,null,null,null,null,null,null,null,0,0]
[0,0,0,0,0,0,0,0,"SENIOR",null,"MUÑOZ LÓPEZ","JUAN","JUAN MUÑOZ LÓPEZ","25202497V","2000-02-12",2000,25,2,null,"2025-01-03",null,null,null,null,null,null,null,null,null,null,null,null,null,null,null,null,null,null,null,null,null,null,null,null,null,null,null,null,null,null,null,null,null,null,null,null,null,null,null,null,null,null,null,null,null,0,0]
[0,0,0,0,0,0,0,0,"VETERANO",null,"NIETO SÁNCHEZ","JUAN RAMÓN","JUAN RAMÓN NIETO SÁNCHEZ",null,null,1900,125,1,null,"2025-01-03",null,null,null,null,null,null,null,null,null,null,null,null,null,null,null,null,null,null,null,null,null,null,null,null,null,null,null,null,null,null,null,null,null,null,null,null,null,null,null,null,null,null,null,null,null,0,0]
[0,0,0,0,0,0,0,0,"SENIOR",null,"LONCÁ RIAU","JUDITH","JUDITH LONCÁ RIAU","47984129B","2004-08-29",2004,21,8,null,"2025-01-03",null,null,null,null,null,null,null,null,null,null,null,null,null,null,null,null,null,null,null,null,null,null,null,null,null,null,null,null,null,null,null,null,null,null,null,null,null,null,null,null,null,null,null,null,null,0,0]
[0,0,0,0,0,0,0,0,"VETERANO",null,"MURILLO AGUILAR","JUDITH","JUDITH MURILLO AGUILAR","73157805A","1984-04-12",1984,41,4,null,"2025-01-03",null,null,null,null,null,null,null,null,null,null,null,null,null,null,null,null,null,null,null,null,null,null,null,null,null,null,null,null,null,null,null,null,null,null,null,null,null,null,null,null,null,null,null,null,null,0,0]
[0,0,0,0,0,0,0,0,"CADETE",null,"MODREGO CANTORNA","JULIA","JULIA MODREGO CANTORNA",null,"2009-08-17",2009,16,8,null,"2025-01-03",null,null,null,null,null,null,null,null,null,null,null,null,null,null,null,null,null,null,null,null,null,null,null,null,null,null,null,null,null,null,null,null,null,null,null,null,null,null,null,null,null,null,null,null,null,0,0]
[0,0,0,0,0,0,0,0,"JUVENIL",null,"PIÑEDO TORRES","JULIA","JULIA PIÑEDO TORRES","73471536Z","2008-04-10",2008,17,4,null,"2025-01-03",null,null,null,null,null,null,null,null,null,null,null,null,null,null,null,null,null,null,null,null,null,null,null,null,null,null,null,null,null,null,null,null,null,null,null,null,null,null,null,null,null,null,null,null,null,0,0]
[0,0,0,0,0,0,0,0,"SENIOR",null,"GÓMEZ RIVERO","JUNCAL","JUNCAL GÓMEZ RIVERO","49252860Q","1999-10-25",1999,26,10,null,"2025-01-03",null,null,null,null,null,null,null,null,null,null,null,null,null,null,null,null,null,null,null,null,null,null,null,null,null,null,null,null,null,null,null,null,null,null,null,null,null,null,null,null,null,null,null,null,null,0,0]
[0,0,0,0,0,0,0,0,"INFANTIL",null,"GARCIA BECHDJ","KARIM","KARIM GARCIA BECHDJ","49941967C","2012-06-07",2012,13,6,null,"2025-01-03",null,null,null,null,null,null,null,null,null,null,null,null,null,null,null,null,null,null,null,null,null,null,null,null,null,null,null,null,null,null,null,null,null,null,null,null,null,null,null,null,null,null,null,null,null,0,0]
[0,0,0,0,0,0,0,0,"JUVENIL",null,"EPPERSON","KATHRYN ELIZABETH","KATHRYN ELIZABETH EPPERSON","A20148362","2008-02-08",2008,17,2,null,"2025-01-03",null,null,null,null,null,null,null,null,null,null,null,null,null,null,null,null,null,null,null,null,null,null,null,null,null,null,null,null,null,null,null,null,null,null,null,null,null,null,null,null,null,null,null,null,null,0,0]
[0,0,0,0,0,0,0,0,"JUVENIL",null,"CHALHI","KHALID","KHALID CHALHI","X8881223A","2007-04-30",2007,18,4,null,"2025-01-03",null,null,null,null,null,null,null,null,null,null,null,null,null,null,null,null,null,null,null,null,null,null,null,null,null,null,null,null,null,null,null,null,null,null,null,null,null,null,null,null,null,null,null,null,null,0,0]
[0,0,0,0,0,0,0,0,"SENIOR",null,"GRACIA ALUTIZ","KIARA","KIARA GRACIA ALUTIZ","73161786M","2001-01-23",2001,24,1,null,"2025-01-03",null,null,null,null,null,null,null,null,null,null,null,null,null,null,null,null,null,null,null,null,null,null,null,null,null,null,null,null,null,null,null,null,null,null,null,null,null,null,null,null,null,null,null,null,null,0,0]
[0,0,0,0,0,0,0,0,"SENIOR",null,"VALVERDE ANDRÉS","KIARA","KIARA VALVERDE ANDRÉS","54752046V","2005-01-27",2005,20,1,null,"2025-01-03",null,null,null,null,null,null,null,null,null,null,null,null,null,null,null,null,null,null,null,null,null,null,null,null,null,null,null,null,null,null,null,null,null,null,null,null,null,null,null,null,null,null,null,null,null,0,0]
[0,0,0,0,0,0,0,0,"SENIOR",null,"MARGUERITE DEMANDE","LARA","LARA MARGUERITE DEMANDE","ES553452","2000-01-24",2000,25,1,null,"2025-01-03",null,null,null,null,null,null,null,null,null,null,null,null,null,null,null,null,null,null,null,null,null,null,null,null,null,null,null,null,null,null,null,null,null,null,null,null,null,null,null,null,null,null,null,null,null,0,0]
[0,0,0,0,0,0,0,0,"ALEVIN",null,"ALONSO VIADER","LAURA",{"$f":"L485&\" \"& K485","v":"LAURA ALONSO VIADER"},"04045774-AND","2013-10-12",{"$f":"YEAR(O485)","v":2013},12,{"$f":"MONTH(O485)","v":10},null,"2025-01-03",null,null,null,null,null,null,null,null,null,null,null,null,null,null,null,null,null,null,null,null,null,null,null,null,null,null,null,null,null,null,null,null,null,null,null,null,null,null,null,null,null,null,null,null,null,0,0]
[0,0,0,0,0,0,0,0,"VETERANO",null,"FERNÁNDEZ GRASA","LAURA","LAURA FERNÁNDEZ GRASA","25480911Q","1982-04-30",1982,43,4,null,"2025-01-03",null,null,null,null,null,null,null,null,null,null,null,null,null,null,null,null,null,null,null,null,null,null,null,null,null,null,null,null,null,null,null,null,null,null,null,null,null,null,null,null,null,null,null,null,null,0,0]
[0,0,0,0,0,0,0,0,"VETERANO",null,"FORNOS NAVARRO","LAURA","LAURA FORNOS NAVARRO","73157468B","1980-02-06",1980,45,2,null,"2025-01-03",null,null,null,null,null,null,null,null,null,null,null,null,null,null,null,null,null,null,null,null,null,null,null,null,null,null,null,null,null,null,null,null,null,null,null,null,null,null,null,null,null,null,null,null,null,0,0]
[0,0,0,0,0,0,0,0,"JUVENIL",null,"JAVIERRE LÓPEZ","LAURA","LAURA JAVIERRE LÓPEZ","26281161G","2007-08-16",2007,18,8,null,"2025-01-03",null,null,null,null,null,null,null,null,null,null,null,null,null,null,null,null,null,null,null,null,null,null,null,null,null,null,null,null,null,null,null,null,null,null,null,null,null,null,null,null,null,null,null,null,null,0,0]
[0,0,0,0,0,0,0,0,"SENIOR",null,"PÉREZ DE ACHA","LEIRE","LEIRE PÉREZ DE ACHA","73163236Y","2001-11-30",2001,24,11,null,"2025-01-03",null,null,null,null,null,null,null,null,null,null,null,null,null,null,null,null,null,null,null,null,null,null,null,null,null,null,null,null,null,null,null,null,null,null,null,null,null,null,null,null,null,null,null,null,null,0,0]
[0,0,0,0,0,0,0,0,"JUVENIL",null,"BADENHOPE","LEO TSAI","LEO TSAI BADENHOPE","A663132507","2008-06-29",2008,17,6,null,"2025-01-03",null,null,null,null,null,null,null,null,null,null,null,null,null,null,null,null,null,null,null,null,null,null,null,null,null,null,null,null,null,null,null,null,null,null,null,null,null,null,null,null,null,null,null,null,null,0,0]
[0,0,0,0,0,0,0,0,"INFANTIL",null,"NEBRA MARTÍNEZ","LEÓN","LEÓN NEBRA MARTÍNEZ","07275528F","2011-07-04",2011,14,7,null,"2025-01-03",null,null,null,null,null,null,null,null,null,null,null,null,null,null,null,null,null,null,null,null,null,null,null,null,null,null,null,null,null,null,null,null,null,null,null,null,null,null,null,null,null,null,null,null,null,0,0]
[0,0,0,0,0,0,0,0,"SENIOR",null,"LEGAZ LAFUENTE","LEYRE","LEYRE LEGAZ LAFUENTE","25208196N","1997-07-07",1997,28,7,null,"2025-01-03",null,null,null,null,null,null,null,null,null,null,null,null,null,null,null,null,null,null,null,null,null,null,null,null,null,null,null,null,null,null,null,null,null,null,null,null,null,null,null,null,null,null,null,null,null,{"$f":"AJ492+AL492+AN492+AP492+AR492+AT492+AV492+AX492+AZ492+BB492+BD492+BF492+BH492+BJ492+BL492","v":0},0]
[{"$f":"IF(J493=\"F\", 1,0)","v":0},{"$f":"IF(I493=\"B\", 1,0)","v":0},{"$f":"IF(I493=\"A\", 1,0)","v":0},{"$f":"IF(I493=\"I\", 1,0)","v":0},{"$f":"IF(I493=\"C\", 1,0)","v":0},{"$f":"IF(I493=\"J\", 1,0)","v":0},{"$f":"IF(I493=\"S\", 1,0)","v":0},{"$f":"IF(I493=\"V\", 1,0)","v":0},"JUVENIL",null,"DÍAZ TORNOE","LIZANDRO","LIZANDRO DÍAZ TORNOE","Y8008733D","2007-02-21",2007,{"$f":"$Y$1-P493","v":18},2,null,"2025-01-03",null,null,null,null,null,null,null,null,null,null,null,null,null,null,null,null,null,null,null,null,null,null,null,null,null,null,null,null,null,null,null,null,null,null,null,null,null,null,null,null,null,null,null,null,null,0,0]
[0,0,0,0,0,0,0,0,"INFANTIL",null,"ESTRADA ROLDÁN","LLUC","LLUC ESTRADA ROLDÁN","49652985X","2011-12-19",2011,14,12,null,"2025-01-03",null,null,null,null,null,null,null,null,null,null,null,null,null,null,null,null,null,null,null,null,null,null,null,null,null,null,null,null,null,null,null,null,null,null,null,null,null,null,null,null,null,null,null,null,null,0,0]
[0,0,0,0,0,0,0,0,"VETERANO",null,"ANDRÉS RODRÍGUEZ","LUCAS","LUCAS ANDRÉS RODRÍGUEZ","71901999C","1992-11-01",1992,33,11,null,"2025-01-03",null,null,null,null,null,null,null,null,null,null,null,null,null,null,null,null,null,null,null,null,null,null,null,null,null,null,null,null,null,null,null,null,null,null,null,null,null,null,null,null,null,null,null,null,null,0,0]
[0,0,0,0,0,0,0,0,"SENIOR",null,"FERRANDO QUÍLEZ","LUCAS","LUCAS FERRANDO QUÍLEZ","17768530H","1995-06-01",1995,30,6,null,"2025-01-03",null,null,null,null,null,null,null,null,null,null,null,null,null,null,null,null,null,null,null,null,null,null,null,null,null,null,null,null,null,null,null,null,null,null,null,null,null,null,null,null,null,null,null,null,null,0,0]
[0,0,0,0,0,0,0,0,"SENIOR",null,"MONTI SCHERZER","LUCAS","LUCAS MONTI SCHERZER","73625175J","2005-08-09",2005,20,8,null,"2025-01-03",null,null,null,null,null,null,null,null,null,null,null,null,null,null,null,null,null,null,null,null,null,null,null,null,null,null,null,null,null,null,null,null,null,null,null,null,null,null,null,null,null,null,null,null,null,0,0]
[0,0,0,0,0,0,0,0,"SENIOR",null,"BOLEA PALOMAR","LUCÍA","LUCÍA BOLEA PALOMAR","73020575Z","2002-07-03",2002,23,7,null,"2025-01-03",null,null,null,null,null,null,null,null,null,null,null,null,null,null,null,null,null,null,null,null,null,null,null,null,null,null,null,null,null,null,null,null,null,null,null,null,null,null,null,null,null,null,null,null,null,0,0]
[0,0,0,0,0,0,0,0,"SENIOR",null,"DE LA LASTRA LANZA","LUCÍA","LUCÍA DE LA LASTRA LANZA","72203788A","1998-10-07",{"$f":"YEAR(O499)","v":1998},27,{"$f":"MONTH(O499)","v":10},null,"2025-01-03",null,null,null,null,null,null,null,null,null,null,null,null,null,null,null,null,null,null,null,null,null,null,null,null,null,null,null,null,null,null,null,null,null,null,null,null,null,null,null,null,null,null,null,null,null,0,0]
[0,0,0,0,0,0,0,0,"SENIOR",null,"JÚDEZ PÉREZ","LUCÍA","LUCÍA JÚDEZ PÉREZ","73050582Y","1998-06-24",1998,27,6,null,"2025-01-03",null,null,null,null,null,null,null,null,null,null,null,null,null,null,null,null,null,null,null,null,null,null,null,null,null,null,null,null,null,null,null,null,null,null,null,null,null,null,null,null,null,null,null,null,null,0,0]
[0,0,0,0,0,0,0,0,"JUVENIL",null,"MÁRQUEZ GUARDIOLA","LUCÍA","LUCÍA MÁRQUEZ GUARDIOLA","20561540T","2007-01-08",2007,18,1,null,"2025-01-03",null,null,null,null,null,null,null,null,null,null,null,null,null,null,null,null,null,null,null,null,null,null,null,null,null,null,null,null,null,null,null,null,null,null,null,null,null,null,null,null,null,null,null,null,null,0,0]
[0,0,0,0,0,0,0,0,"VETERANO",null,"ROCA OLIVER","LUIS JAVIER","LUIS JAVIER ROCA OLIVER","73155610Q","1969-12-22",1969,56,12,null,"2025-01-03",null,null,null,null,null,null,null,null,null,null,null,null,null,null,null,null,null,null,null,null,null,null,null,null,null,null,null,null,null,null,null,null,null,null,null,null,null,null,null,null,null,null,null,null,null,0,0]
[0,0,0,0,0,0,0,0,"BENJAMIN",null,"ARBIOL FORNOS","LUJÁN","LUJÁN ARBIOL FORNOS",null,"2016-06-10",2016,9,6,null,"2025-01-03",null,null,null,null,null,null,null,null,null,null,null,null,null,null,null,null,null,null,null,null,null,null,null,null,null,null,null,null,null,null,null,null,null,null,null,null,null,null,null,null,null,null,null,null,null,0,0]
[0,0,0,0,0,0,0,0,"CADETE",null,"EHRET GARCÍA","MAELYA ","MAELYA  EHRET GARCÍA","130681102689-FR","2009-09-18",2009,16,9,null,"2025-01-03",null,null,null,null,null,null,null,null,null,null,null,null,null,null,null,null,null,null,null,null,null,null,null,null,null,null,null,null,null,null,null,null,null,null,null,null,null,null,null,null,null,null,null,null,null,0,0]
[0,0,0,0,0,0,0,0,"SENIOR",null,"BERNAL LECINA","MANUEL","MANUEL BERNAL LECINA","17768020Z","1995-09-01",1995,30,9,null,"2025-01-03",null,null,null,null,null,null,null,null,null,null,null,null,null,null,null,null,null,null,null,null,null,null,null,null,null,null,null,null,null,null,null,null,null,null,null,null,null,null,null,null,null,null,null,null,null,0,0]
[0,0,0,0,0,0,0,0,"SENIOR",null,"CALVO BOLSA","MANUEL","MANUEL CALVO BOLSA","73028823M","1998-04-27",1998,27,4,null,"2025-01-03",null,null,null,null,null,null,null,null,null,null,null,null,null,null,null,null,null,null,null,null,null,null,null,null,null,null,null,null,null,null,null,null,null,null,null,null,null,null,null,null,null,null,null,null,null,0,0]
[0,0,0,0,0,0,0,0,"CADETE",null,"NOVIALS OLIVER","MARA","MARA NOVIALS OLIVER","21749421T","2009-12-17",2009,16,12,null,"2025-01-03",null,null,null,null,null,null,null,null,null,null,null,null,null,null,null,null,null,null,null,null,null,null,null,null,null,null,null,null,null,null,null,null,null,null,null,null,null,null,null,null,null,null,null,null,null,0,0]
[0,0,0,0,0,0,0,0,"ALEVIN",null,"OLIVER IBARZ","MARC","MARC OLIVER IBARZ","09826491V","2013-08-31",2013,12,8,null,"2025-01-03",null,null,null,null,null,null,null,null,null,null,null,null,null,null,null,null,null,null,null,null,null,null,null,null,null,null,null,null,null,null,null,null,null,null,null,null,null,null,null,null,null,null,null,null,null,0,0]
[0,0,0,0,0,0,0,0,"CADETE",null,"LÁZARO SANTABÁRBARA","MARCOS","MARCOS LÁZARO SANTABÁRBARA","26275487B","2009-01-31",2009,16,1,null,"2025-01-03",null,null,null,null,null,null,null,null,null,null,null,null,null,null,null,null,null,null,null,null,null,null,null,null,null,null,null,null,null,null,null,null,null,null,null,null,null,null,null,null,null,null,null,null,null,0,0]
[0,0,0,0,0,0,0,0,"INFANTIL",null,"LUNA IBARZ","MARCOS","MARCOS LUNA IBARZ","09825144G","2011-05-30",2011,14,5,null,"2025-01-03",null,null,null,null,null,null,null,null,null,null,null,null,null,null,null,null,null,null,null,null,null,null,null,null,null,null,null,null,null,null,null,null,null,null,null,null,null,null,null,null,null,null,null,null,null,0,0]
[0,0,0,0,0,0,0,0,"SENIOR",null,"MARTÍNEZ IBÁÑEZ","MARCOS","MARCOS MARTÍNEZ IBÁÑEZ","73019004F","1998-01-17",1998,27,1,null,"2025-01-03",null,null,null,null,null,null,null,null,null,null,null,null,null,null,null,null,null,null,null,null,null,null,null,null,null,null,null,null,null,null,null,null,null,null,null,null,null,null,null,null,null,null,null,null,null,0,0]
[0,0,0,0,0,0,0,0,"SENIOR",null,"AGUD MONTAÑES","MARÍA","MARÍA AGUD MONTAÑES","48007709Q","1999-01-01",1999,26,1,null,"2025-01-03",null,null,null,null,null,null,null,null,null,null,null,null,null,null,null,null,null,null,null,null,null,null,null,null,null,null,null,null,null,null,null,null,null,null,null,null,null,null,null,null,null,null,null,null,null,0,0]
[0,0,0,0,0,0,0,0,"SENIOR",null,"ALGUERÓ NADAL","MARÍA","MARÍA ALGUERÓ NADAL","73108457J","1997-07-27",1997,28,7,null,"2025-01-03",null,null,null,null,null,null,null,null,null,null,null,null,null,null,null,null,null,null,null,null,null,null,null,null,null,null,null,null,null,null,null,null,null,null,null,null,null,null,null,null,null,null,null,null,null,0,0]
[0,0,0,0,0,0,0,0,"SENIOR",null,"ALONSO GUTIÉRREZ","MARÍA","MARÍA ALONSO GUTIÉRREZ","77223684B","2002-11-19",2002,23,11,null,"2025-01-03",null,null,null,null,null,null,null,null,null,null,null,null,null,null,null,null,null,null,null,null,null,null,null,null,null,null,null,null,null,null,null,null,null,null,null,null,null,null,null,null,null,null,null,null,null,0,0]
[0,0,0,0,0,0,0,0,"VETERANO",null,"GÓMEZ DE MENA","MARÍA CRISTINA","MARÍA CRISTINA GÓMEZ DE MENA","17726223P","1969-08-22",1969,56,8,null,"2025-01-03",null,null,null,null,null,null,null,null,null,null,null,null,null,null,null,null,null,null,null,null,null,null,null,null,null,null,null,null,null,null,null,null,null,null,null,null,null,null,null,null,null,null,null,null,null,0,0]
[0,0,0,0,0,0,0,0,"SENIOR",null,"DUESO BELVER","MARÍA","MARÍA DUESO BELVER","73167579W","2002-01-14",2002,23,1,null,"2025-01-03",null,null,null,null,null,null,null,null,null,null,null,null,null,null,null,null,null,null,null,null,null,null,null,null,null,null,null,null,null,null,null,null,null,null,null,null,null,null,null,null,null,null,null,null,null,0,0]
[0,0,0,0,0,0,0,0,"VETERANO",null,"RIVERO MINNERY","MARÍA INÉS","MARÍA INÉS RIVERO MINNERY","31731419K","1982-09-04",1982,43,9,null,"2025-01-03",null,null,null,null,null,null,null,null,null,null,null,null,null,null,null,null,null,null,null,null,null,null,null,null,null,null,null,null,null,null,null,null,null,null,null,null,null,null,null,null,null,null,null,null,null,0,0]
[0,0,0,0,0,0,0,0,"VETERANO",null,"MUNIESA NAVARRO","MARÍA INMACULADA","MARÍA INMACULADA MUNIESA NAVARRO","29111199F","1973-05-20",1973,52,5,null,"2025-01-03",null,null,null,null,null,null,null,null,null,null,null,null,null,null,null,null,null,null,null,null,null,null,null,null,null,null,null,null,null,null,null,null,null,null,null,null,null,null,null,null,null,null,null,null,null,0,0]
[0,0,0,0,0,0,0,0,"VETERANO",null,"BLASCO OLIETE","MARÍA ISABEL","MARÍA ISABEL BLASCO OLIETE","25456520M","1972-11-05",1972,53,11,null,"2025-01-03",null,null,null,null,null,null,null,null,null,null,null,null,null,null,null,null,null,null,null,null,null,null,null,null,null,null,null,null,null,null,null,null,null,null,null,null,null,null,null,null,null,null,null,null,null,0,0]
[0,0,0,0,0,0,0,0,{"$f":"IF((Q520<11),\"BENJAMIN\",IF(OR(Q520=11,Q520=12),\"ALEVIN\",IF(OR(Q520=13,Q520=14),\"INFANTIL\",IF(OR(Q520=15,Q520=16),\"CADETE\",IF(OR(Q520=17,Q520=18),\"JUVENIL\",IF(AND(Q520>18,Q520<31),\"SENIOR\",\"VETERANO\"))))))","v":"VETERANO"},null,"TOLOSANA ARBONES","MARÍA ISABEL","MARÍA ISABEL TOLOSANA ARBONES","25455727V","1971-07-19",1971,54,7,null,"2025-01-03",null,null,null,null,null,null,null,null,null,null,null,null,null,null,null,null,null,null,null,null,null,null,null,null,null,null,null,null,null,null,null,null,null,null,null,null,null,null,null,null,null,null,null,null,null,0,0]
[0,0,0,0,0,0,0,0,"VETERANO",null,"GONZALVO ITURRIAGA","MARÍA JESÚS","MARÍA JESÚS GONZALVO ITURRIAGA","25163912A","1972-10-25",1972,53,10,null,"2025-01-03",null,null,null,null,null,null,null,null,null,null,null,null,null,null,null,null,null,null,null,null,null,null,null,null,null,null,null,null,null,null,null,null,null,null,null,null,null,null,null,null,null,null,null,null,null,0,0]
[0,0,0,0,0,0,0,0,"VETERANO",null,"PÉREZ MALLÉN","MARÍA JOSÉ","MARÍA JOSÉ PÉREZ MALLÉN","25457548K","1972-08-26",1972,53,8,null,"2025-01-03",null,null,null,null,null,null,null,null,null,null,null,null,null,null,null,null,null,null,null,null,null,null,null,null,null,null,null,null,null,null,null,null,null,null,null,null,null,null,null,null,null,null,null,null,null,0,0]
[0,0,0,0,0,0,0,0,"VETERANO",null,"RODRÍGUEZ BRAÑA","MARÍA LOURDES","MARÍA LOURDES RODRÍGUEZ BRAÑA","33548326C","1989-03-25",1989,36,3,null,"2025-01-03",null,null,null,null,null,null,null,null,null,null,null,null,null,null,null,null,null,null,null,null,null,null,null,null,null,null,null,null,null,null,null,null,null,null,null,null,null,null,null,null,null,null,null,null,null,0,0]
[0,0,0,0,0,0,0,0,"VETERANO",null,"USED LAHOZ","MARÍA PILAR","MARÍA PILAR USED LAHOZ","29110984E","1974-11-29",1974,51,11,null,"2025-01-03",null,null,null,null,null,null,null,null,null,null,null,null,null,null,null,null,null,null,null,null,null,null,null,null,null,null,null,null,null,null,null,null,null,null,null,null,null,null,null,null,null,null,null,null,null,0,0]
[0,0,0,0,0,0,0,0,"VETERANO",null,"GRAU JALLE","MARÍA TERESA","MARÍA TERESA GRAU JALLE","25447001P","1972-02-19",1972,53,2,null,"2025-01-03",null,null,null,null,null,null,null,null,null,null,null,null,null,null,null,null,null,null,null,null,null,null,null,null,null,null,null,null,null,null,null,null,null,null,null,null,null,null,null,null,null,null,null,null,null,0,0]
[0,0,0,0,0,0,0,0,"SENIOR",null,"MIHAI","MARIAN-MADALIN","MARIAN-MADALIN MIHAI","Y7527100L","2000-04-03",2000,25,4,null,"2025-01-03",null,null,null,null,null,null,null,null,null,null,null,null,null,null,null,null,null,null,null,null,null,null,null,null,null,null,null,null,null,null,null,null,null,null,null,null,null,null,null,null,null,null,null,null,null,0,0]
[0,0,0,0,0,0,0,0,"SENIOR",null,"MARTÍNEZ FERNÁNDEZ","MARINA","MARINA MARTÍNEZ FERNÁNDEZ","73024631E","2002-10-27",2002,23,10,null,"2025-01-03",null,null,null,null,null,null,null,null,null,null,null,null,null,null,null,null,null,null,null,null,null,null,null,null,null,null,null,null,null,null,null,null,null,null,null,null,null,null,null,null,null,null,null,null,null,0,0]
[0,0,0,0,0,0,0,0,"SENIOR",null,"OLIVEROS BLANCO","MARINO","MARINO OLIVEROS BLANCO","77221324C","2004-08-21",2004,21,8,null,"2025-01-03",null,null,null,null,null,null,null,null,null,null,null,null,null,null,null,null,null,null,null,null,null,null,null,null,null,null,null,null,null,null,null,null,null,null,null,null,null,null,null,null,null,null,null,null,null,0,0]
[0,0,0,0,0,0,0,0,"CADETE",null,"OTEGUI SANTOLARIA","MARKEL",{"$f":"L529&\" \"& K529","v":"MARKEL OTEGUI SANTOLARIA"},"49752957R","2009-11-02",{"$f":"YEAR(O529)","v":2009},16,{"$f":"MONTH(O529)","v":11},null,"2025-01-03",null,null,null,null,null,null,null,null,null,null,null,null,null,null,null,null,null,null,null,null,null,null,null,null,null,null,null,null,null,null,null,null,null,null,null,null,null,null,null,null,null,null,null,null,null,0,0]
[0,0,0,0,0,0,0,0,"VETERANO",null,"GAYA JORNET","MARTA ","MARTA  GAYA JORNET","43724983M","1977-03-08",1977,48,3,null,"2025-01-03",null,null,null,null,null,null,null,null,null,null,null,null,null,null,null,null,null,null,null,null,null,null,null,null,null,null,null,null,null,null,null,null,null,null,null,null,null,null,null,null,null,null,null,null,null,0,0]
[0,0,0,0,0,0,0,0,"VETERANO",null,"ESCALONA COLOMÉ","MARTA FERNANDA","MARTA FERNANDA ESCALONA COLOMÉ","73202302H","1976-07-09",1976,49,7,null,"2025-01-03",null,null,null,null,null,null,null,null,null,null,null,null,null,null,null,null,null,null,null,null,null,null,null,null,null,null,null,null,null,null,null,null,null,null,null,null,null,null,null,null,null,null,null,null,null,0,0]
[0,0,0,0,0,0,0,0,"JUVENIL",null,"LARIO MARTÍNEZ","MARTA","MARTA LARIO MARTÍNEZ","77220990P","2007-06-29",2007,18,6,null,"2025-01-03",null,null,null,null,null,null,null,null,null,null,null,null,null,null,null,null,null,null,null,null,null,null,null,null,null,null,null,null,null,null,null,null,null,null,null,null,null,null,null,null,null,null,null,null,null,0,0]
[0,0,0,0,0,0,0,0,"JUVENIL",null,"BOLEA PALOMAR","MARTÍN","MARTÍN BOLEA PALOMAR","26275321Y","2007-12-02",2007,18,12,null,"2025-01-03",null,null,null,null,null,null,null,null,null,null,null,null,null,null,null,null,null,null,null,null,null,null,null,null,null,null,null,null,null,null,null,null,null,null,null,null,null,null,null,null,null,null,null,null,null,0,0]
[0,0,0,0,0,0,0,0,"INFANTIL",null,"ESTEVE NEVADO","MARTINA","MARTINA ESTEVE NEVADO","21748358H","2012-08-08",2012,13,8,null,"2025-01-03",null,null,null,null,null,null,null,null,null,null,null,null,null,null,null,null,null,null,null,null,null,null,null,null,null,null,null,null,null,null,null,null,null,null,null,null,null,null,null,null,null,null,null,null,null,0,0]
[0,0,0,0,0,0,0,0,"ALEVIN",null,"VELILLA PÉREZ","MARTINA","MARTINA VELILLA PÉREZ","-","2014-05-14",2014,11,5,null,"2025-01-03",null,null,null,null,null,null,null,null,null,null,null,null,null,null,null,null,null,null,null,null,null,null,null,null,null,null,null,null,null,null,null,null,null,null,null,null,null,null,null,null,null,null,null,null,null,0,0]
[0,0,0,0,0,0,0,0,"VETERANO",null,"LLOP CALLIZO","MERITXELL","MERITXELL LLOP CALLIZO","73086549R","1984-08-23",1984,41,8,null,"2025-01-03",null,null,null,null,null,null,null,null,null,null,null,null,null,null,null,null,null,null,null,null,null,null,null,null,null,null,null,null,null,null,null,null,null,null,null,null,null,null,null,null,null,null,null,null,null,0,0]
[0,0,0,0,0,0,0,0,"VETERANO",null,"SIMÓN MARTÍN","MERITXELL","MERITXELL SIMÓN MARTÍN","47767253W","1981-06-26",1981,44,6,null,"2025-01-03",null,null,null,null,null,null,null,null,null,null,null,null,null,null,null,null,null,null,null,null,null,null,null,null,null,null,null,null,null,null,null,null,null,null,null,null,null,null,null,null,null,null,null,null,null,0,0]
[0,0,0,0,0,0,0,0,"JUVENIL",null,"ABENIA CÁMARA","MIGUEL","MIGUEL ABENIA CÁMARA","73164978T","2008-11-07",2008,17,11,null,"2025-01-03",null,null,null,null,null,null,null,null,null,null,null,null,null,null,null,null,null,null,null,null,null,null,null,null,null,null,null,null,null,null,null,null,null,null,null,null,null,null,null,null,null,null,null,null,null,0,0]
[0,0,0,0,0,0,0,0,"VETERANO",null,"AJA BARQUÍN","MIGUEL","MIGUEL AJA BARQUÍN","72085089F","1987-06-25",1987,38,6,null,"2025-01-03",null,null,null,null,null,null,null,null,null,null,null,null,null,null,null,null,null,null,null,null,null,null,null,null,null,null,null,null,null,null,null,null,null,null,null,null,null,null,null,null,null,null,null,null,null,0,0]
[0,0,0,0,0,0,0,0,"SENIOR",null,"BIEL CAMAÑES","MIGUEL","MIGUEL BIEL CAMAÑES","73440266R","2005-04-22",2005,20,4,null,"2025-01-03",null,null,null,null,null,null,null,null,null,null,null,null,null,null,null,null,null,null,null,null,null,null,null,null,null,null,null,null,null,null,null,null,null,null,null,null,null,null,null,null,null,null,null,null,null,0,0]
[0,0,0,0,0,0,0,0,"SENIOR",null,"CORZÁN LÓPEZ","MIGUEL","MIGUEL CORZÁN LÓPEZ","25210954X","1998-02-27",1998,27,2,null,"2025-01-03",null,null,null,null,null,null,null,null,null,null,null,null,null,null,null,null,null,null,null,null,null,null,null,null,null,null,null,null,null,null,null,null,null,null,null,null,null,null,null,null,null,null,null,null,null,0,0]
[0,0,0,0,0,0,0,0,"VETERANO",null,"BERENGUER CÉSPEDES","MÓNICA","MÓNICA BERENGUER CÉSPEDES","43721755C","1975-03-09",1975,50,3,null,"2025-01-03",null,null,null,null,null,null,null,null,null,null,null,null,null,null,null,null,null,null,null,null,null,null,null,null,null,null,null,null,null,null,null,null,null,null,null,null,null,null,null,null,null,null,null,null,null,0,0]
[0,0,0,0,0,0,0,0,"VETERANO",null,"CRESPO SETIÉN","MONTSERRAT","MONTSERRAT CRESPO SETIÉN","4790054G","1987-09-03",1987,38,9,null,"2025-01-03",null,null,null,null,null,null,null,null,null,null,null,null,null,null,null,null,null,null,null,null,null,null,null,null,null,null,null,null,null,null,null,null,null,null,null,null,null,null,null,null,null,null,null,null,null,0,0]
[0,0,0,0,0,0,0,0,"SENIOR",null,"PALAU LARA","MONTSERRAT","MONTSERRAT PALAU LARA","53663872L","1996-05-07",1996,29,5,null,"2025-01-03",null,null,null,null,null,null,null,null,null,null,null,null,null,null,null,null,null,null,null,null,null,null,null,null,null,null,null,null,null,null,null,null,null,null,null,null,null,null,null,null,null,null,null,null,null,0,0]
[0,0,0,0,0,0,0,0,"ALEVIN",null,"GUARDIOLA BARTOLOMÉ","NAIA","NAIA GUARDIOLA BARTOLOMÉ","09825022C","2013-10-18",2013,12,10,null,"2025-01-03",null,null,null,null,null,null,null,null,null,null,null,null,null,null,null,null,null,null,null,null,null,null,null,null,null,null,null,null,null,null,null,null,null,null,null,null,null,null,null,null,null,null,null,null,null,0,0]
[0,0,0,0,0,0,0,0,"VETERANO",null,"NOUALI EL GUENNOUNI","NAJAT","NAJAT NOUALI EL GUENNOUNI","X6900692W","1977-01-01",1977,48,1,null,"2025-01-03",null,null,null,null,null,null,null,null,null,null,null,null,null,null,null,null,null,null,null,null,null,null,null,null,null,null,null,null,null,null,null,null,null,null,null,null,null,null,null,null,null,null,null,null,null,0,0]
[0,0,0,0,0,0,0,0,"SENIOR",null,"SERRANO GUALLAR","NATALIA","NATALIA SERRANO GUALLAR","73615918W","2002-06-13",2002,23,6,null,"2025-01-03",null,null,null,null,null,null,null,null,null,null,null,null,null,null,null,null,null,null,null,null,null,null,null,null,null,null,null,null,null,null,null,null,null,null,null,null,null,null,null,null,null,null,null,null,null,0,0]
[0,0,0,0,0,0,0,0,"JUVENIL",null,"KOGUT","NICOL","NICOL KOGUT","X8625182K","2007-01-23",2007,18,1,null,"2025-01-03",null,null,null,null,null,null,null,null,null,null,null,null,null,null,null,null,null,null,null,null,null,null,null,null,null,null,null,null,null,null,null,null,null,null,null,null,null,null,null,null,null,null,null,null,null,0,0]
[0,0,0,0,0,0,0,0,"JUVENIL",null,"FAURE MARTÍN","NICOLÁS","NICOLÁS FAURE MARTÍN","73286615J","2008-07-31",2008,17,7,null,"2025-01-03",null,null,null,null,null,null,null,null,null,null,null,null,null,null,null,null,null,null,null,null,null,null,null,null,null,null,null,null,null,null,null,null,null,null,null,null,null,null,null,null,null,null,null,null,null,0,0]
[0,0,0,0,0,0,0,0,"VETERANO",null,"GONZÁLEZ FERNÁNCEZ","NICOLÁS","NICOLÁS GONZÁLEZ FERNÁNCEZ",null,null,1900,125,1,null,"2025-01-03",null,null,null,null,null,null,null,null,null,null,null,null,null,null,null,null,null,null,null,null,null,null,null,null,null,null,null,null,null,null,null,null,null,null,null,null,null,null,null,null,null,null,null,null,null,0,0]
[0,0,0,0,0,0,0,0,"ALEVIN",null,"PALAU FERRAGUT","NOA","NOA PALAU FERRAGUT","49757430N","2013-02-10",2013,12,2,null,"2025-01-03",null,null,null,null,null,null,null,null,null,null,null,null,null,null,null,null,null,null,null,null,null,null,null,null,null,null,null,null,null,null,null,null,null,null,null,null,null,null,null,null,null,null,null,null,null,0,0]
[0,0,0,0,0,0,0,0,"VETERANO",null,"ARA GRACIA","NOELIA","NOELIA ARA GRACIA","18169624S","1981-09-21",1981,44,9,null,"2025-01-03",null,null,null,null,null,null,null,null,null,null,null,null,null,null,null,null,null,null,null,null,null,null,null,null,null,null,null,null,null,null,null,null,null,null,null,null,null,null,null,null,null,null,null,null,null,0,0]
[0,0,0,0,0,0,0,0,"SENIOR",null,"MARTÍN TORRES","ÓSCAR","ÓSCAR MARTÍN TORRES","73132652N","2001-08-18",2001,24,8,null,"2025-01-03",null,null,null,null,null,null,null,null,null,null,null,null,null,null,null,null,null,null,null,null,null,null,null,null,null,null,null,null,null,null,null,null,null,null,null,null,null,null,null,null,null,null,null,null,null,0,0]
[0,0,0,0,0,0,0,0,"SENIOR",null,"ALONSO RAMOS","PABLO","PABLO ALONSO RAMOS","73130756W","1998-04-26",1998,27,4,null,"2025-01-03",null,null,null,null,null,null,null,null,null,null,null,null,null,null,null,null,null,null,null,null,null,null,null,null,null,null,null,null,null,null,null,null,null,null,null,null,null,null,null,null,null,null,null,null,null,0,0]
[0,0,0,0,0,0,0,0,"SENIOR",null,"JURADO PÉREZ","PABLO","PABLO JURADO PÉREZ","25362243M","2002-01-15",2002,23,1,null,"2025-01-03",null,null,null,null,null,null,null,null,null,null,null,null,null,null,null,null,null,null,null,null,null,null,null,null,null,null,null,null,null,null,null,null,null,null,null,null,null,null,null,null,null,null,null,null,null,0,0]
[0,0,0,0,0,0,0,0,"VETERANO",null,"SERRANO MARTÍNEZ","PABLO","PABLO SERRANO MARTÍNEZ",null,null,1900,125,1,null,"2025-01-03",null,null,null,null,null,null,null,null,null,null,null,null,null,null,null,null,null,null,null,null,null,null,null,null,null,null,null,null,null,null,null,null,null,null,null,null,null,null,null,null,null,null,null,null,null,{"$f":"AJ556+AL556+AN556+AP556+AR556+AT556+AV556+AX556+AZ556+BB556+BD556+BF556+BH556+BJ556+BL556","v":0},0]
[{"$f":"IF(J557=\"F\", 1,0)","v":0},{"$f":"IF(I557=\"B\", 1,0)","v":0},{"$f":"IF(I557=\"A\", 1,0)","v":0},{"$f":"IF(I557=\"I\", 1,0)","v":0},{"$f":"IF(I557=\"C\", 1,0)","v":0},{"$f":"IF(I557=\"J\", 1,0)","v":0},{"$f":"IF(I557=\"S\", 1,0)","v":0},{"$f":"IF(I557=\"V\", 1,0)","v":0},"SENIOR",null,"VAL CAMPILLO","PABLO","PABLO VAL CAMPILLO","25204460W","1998-09-09",1998,{"$f":"$Y$1-P557","v":27},9,null,"2025-01-03",null,null,null,null,null,null,null,null,null,null,null,null,null,null,null,null,null,null,null,null,null,null,null,null,null,null,null,null,null,null,null,null,null,null,null,null,null,null,null,null,null,null,null,null,null,0,0]
[0,0,0,0,0,0,0,0,"VETERANO",null,"GIMENO RIAU","PALOMA","PALOMA GIMENO RIAU","48050614A","1993-11-05",1993,32,11,null,"2025-01-03",null,null,null,null,null,null,null,null,null,null,null,null,null,null,null,null,null,null,null,null,null,null,null,null,null,null,null,null,null,null,null,null,null,null,null,null,null,null,null,null,null,null,null,null,null,0,0]
[0,0,0,0,0,0,0,0,"VETERANO",null,"MOLINA ALONSO","PAOLA","PAOLA MOLINA ALONSO","17744112A","1988-07-09",1988,37,7,null,"2025-01-03",null,null,null,null,null,null,null,null,null,null,null,null,null,null,null,null,null,null,null,null,null,null,null,null,null,null,null,null,null,null,null,null,null,null,null,null,null,null,null,null,null,null,null,null,null,0,0]
[0,0,0,0,0,0,0,0,"SENIOR",null,"BARAT CORTÉS","PATRICIA","PATRICIA BARAT CORTÉS","73478473M","2001-12-12",2001,24,12,null,"2025-01-03",null,null,null,null,null,null,null,null,null,null,null,null,null,null,null,null,null,null,null,null,null,null,null,null,null,null,null,null,null,null,null,null,null,null,null,null,null,null,null,null,null,null,null,null,null,0,0]
[0,0,0,0,0,0,0,0,"VETERANO",null,"BETRIÁN HERRERA","PATRICIA","PATRICIA BETRIÁN HERRERA","73205438A","1980-11-25",1980,45,11,null,"2025-01-03",null,null,null,null,null,null,null,null,null,null,null,null,null,null,null,null,null,null,null,null,null,null,null,null,null,null,null,null,null,null,null,null,null,null,null,null,null,null,null,null,null,null,null,null,null,0,0]
[0,0,0,0,0,0,0,0,"VETERANO",null,"MOLINA McGHEE","PATRICIA","PATRICIA MOLINA McGHEE","05258621Q","1964-09-20",1964,61,9,null,"2025-01-03",null,null,null,null,null,null,null,null,null,null,null,null,null,null,null,null,null,null,null,null,null,null,null,null,null,null,null,null,null,null,null,null,null,null,null,null,null,null,null,null,null,null,null,null,null,0,0]
[0,0,0,0,0,0,0,0,"JUVENIL",null,"MUÑOZ OCHOA","PATRICIA","PATRICIA MUÑOZ OCHOA","07274969T","2007-08-22",2007,18,8,null,"2025-01-03",null,null,null,null,null,null,null,null,null,null,null,null,null,null,null,null,null,null,null,null,null,null,null,null,null,null,null,null,null,null,null,null,null,null,null,null,null,null,null,null,null,null,null,null,null,0,0]
[0,0,0,0,0,0,0,0,"JUVENIL",null,"MURIAGO PÉREZ-LIZANU","PATRICIA","PATRICIA MURIAGO PÉREZ-LIZANU","73470604W","2007-07-05",2007,18,7,null,"2025-01-03",null,null,null,null,null,null,null,null,null,null,null,null,null,null,null,null,null,null,null,null,null,null,null,null,null,null,null,null,null,null,null,null,null,null,null,null,null,null,null,null,null,null,null,null,null,0,0]
[0,0,0,0,0,0,0,0,"VETERANO",null,"INEVA SALILLAS","PAÚL","PAÚL INEVA SALILLAS","17845772A","1952-09-08",1952,73,9,null,"2025-01-03",null,null,null,null,null,null,null,null,null,null,null,null,null,null,null,null,null,null,null,null,null,null,null,null,null,null,null,null,null,null,null,null,null,null,null,null,null,null,null,null,null,null,null,null,null,0,0]
[0,0,0,0,0,0,0,0,"SENIOR",null,"FALCÓ FLETA","PAULA","PAULA FALCÓ FLETA","77219543X","1997-01-26",1997,28,1,null,"2025-01-03",null,null,null,null,null,null,null,null,null,null,null,null,null,null,null,null,null,null,null,null,null,null,null,null,null,null,null,null,null,null,null,null,null,null,null,null,null,null,null,null,null,null,null,null,null,0,0]
[0,0,0,0,0,0,0,0,"INFANTIL",null,"GÓMEZ CARMONA","PAULA","PAULA GÓMEZ CARMONA","09826952H","2012-07-24",2012,13,7,null,"2025-01-03",null,null,null,null,null,null,null,null,null,null,null,null,null,null,null,null,null,null,null,null,null,null,null,null,null,null,null,null,null,null,null,null,null,null,null,null,null,null,null,null,null,null,null,null,null,0,0]
[0,0,0,0,0,0,0,0,"SENIOR",null,"LORDA BESTUÉ","PAULA","PAULA LORDA BESTUÉ","73163318L","1999-04-10",1999,26,4,null,"2025-01-03",null,null,null,null,null,null,null,null,null,null,null,null,null,null,null,null,null,null,null,null,null,null,null,null,null,null,null,null,null,null,null,null,null,null,null,null,null,null,null,null,null,null,null,null,null,0,0]
[0,0,0,0,0,0,0,0,"SENIOR",null,"ARNILLAS IBARZ","PAULA MARÍA","PAULA MARÍA ARNILLAS IBARZ","73107553Y","2004-05-12",{"$f":"YEAR(O569)","v":2004},21,{"$f":"MONTH(O569)","v":5},null,"2025-01-03",null,null,null,null,null,null,null,null,null,null,null,null,null,null,null,null,null,null,null,null,null,null,null,null,null,null,null,null,null,null,null,null,null,null,null,null,null,null,null,null,null,null,null,null,null,0,0]
[0,0,0,0,0,0,0,0,"SENIOR",null,"ARNILLAS IBARZ","PAULA MARÍA","PAULA MARÍA ARNILLAS IBARZ","73107553Y","2004-05-12",{"$f":"YEAR(O570)","v":2004},21,{"$f":"MONTH(O570)","v":5},null,"2025-01-03",null,null,null,null,null,null,null,null,null,null,null,null,null,null,null,null,null,null,null,null,null,null,null,null,null,null,null,null,null,null,null,null,null,null,null,null,null,null,null,null,null,null,null,null,null,0,0]
[0,0,0,0,0,0,0,0,"VETERANO",null,"RODRÍGUEZ CAMBRA","PAULA","PAULA RODRÍGUEZ CAMBRA","25204221Q","1993-07-28",{"$f":"YEAR(O571)","v":1993},32,{"$f":"MONTH(O571)","v":7},null,"2025-01-03",null,null,null,null,null,null,null,null,null,null,null,null,null,null,null,null,null,null,null,null,null,null,null,null,null,null,null,null,null,null,null,null,null,null,null,null,null,null,null,null,null,null,null,null,null,0,0]
[0,0,0,0,0,0,0,0,"JUVENIL",null,"VERA JARQUE","PAULA","PAULA VERA JARQUE","49384075Q","2007-12-21",{"$f":"YEAR(O572)","v":2007},18,{"$f":"MONTH(O572)","v":12},null,"2025-01-03",null,null,null,null,null,null,null,null,null,null,null,null,null,null,null,null,null,null,null,null,null,null,null,null,null,null,null,null,null,null,null,null,null,null,null,null,null,null,null,null,null,null,null,null,null,0,0]
[0,0,0,0,0,0,0,0,"SENIOR",null,"LORENZ CALVO","PEDRO ALEJANDRO","PEDRO ALEJANDRO LORENZ CALVO","73160019D","2000-06-24",2000,25,6,null,"2025-01-03",null,null,null,null,null,null,null,null,null,null,null,null,null,null,null,null,null,null,null,null,null,null,null,null,null,null,null,null,null,null,null,null,null,null,null,null,null,null,null,null,null,null,null,null,null,0,0]
[0,0,0,0,0,0,0,0,"VETERANO",null,"MARTÍNEZ CABELLO","PEDRO IGNACIO",{"$f":"L574&\" \"& K574","v":"PEDRO IGNACIO MARTÍNEZ CABELLO"},"17694366Y","1957-04-29",{"$f":"YEAR(O574)","v":1957},68,{"$f":"MONTH(O574)","v":4},null,"2025-01-03",null,null,null,null,null,null,null,null,null,null,null,null,null,null,null,null,null,null,null,null,null,null,null,null,null,null,null,null,null,null,null,null,null,null,null,null,null,null,null,null,null,null,null,null,null,0,0]
[0,0,0,0,0,0,0,0,"SENIOR",null,"OLLOQUI LÁZARO","PEDRO","PEDRO OLLOQUI LÁZARO","77134640T","2005-08-16",2005,20,8,null,"2025-01-03",null,null,null,null,null,null,null,null,null,null,null,null,null,null,null,null,null,null,null,null,null,null,null,null,null,null,null,null,null,null,null,null,null,null,null,null,null,null,null,null,null,null,null,null,null,0,0]
[0,0,0,0,0,0,0,0,"VETERANO",null,"VILLAR MARTÍNEZ","PEDRO","PEDRO VILLAR MARTÍNEZ","17150748Q","1961-05-25",1961,64,5,null,"2025-01-03",null,null,null,null,null,null,null,null,null,null,null,null,null,null,null,null,null,null,null,null,null,null,null,null,null,null,null,null,null,null,null,null,null,null,null,null,null,null,null,null,null,null,null,null,null,0,0]
[0,0,0,0,0,0,0,0,"SENIOR",null,"CORTÉS MORENO","RAÚL ÁNGEL","RAÚL ÁNGEL CORTÉS MORENO","73134898G","2001-04-06",2001,24,4,null,"2025-01-03",null,null,null,null,null,null,null,null,null,null,null,null,null,null,null,null,null,null,null,null,null,null,null,null,null,null,null,null,null,null,null,null,null,null,null,null,null,null,null,null,null,null,null,null,null,0,0]
[0,0,0,0,0,0,0,0,"VETERANO",null,"NOGUERAS PUEYO","RAÚL","RAÚL NOGUERAS PUEYO","18035857Q","1973-09-19",1973,52,9,null,"2025-01-03",null,null,null,null,null,null,null,null,null,null,null,null,null,null,null,null,null,null,null,null,null,null,null,null,null,null,null,null,null,null,null,null,null,null,null,null,null,null,null,null,null,null,null,null,null,0,0]
[0,0,0,0,0,0,0,0,"CADETE",null,"ASO LÓPEZ","REBECA","REBECA ASO LÓPEZ","73032359E","2009-10-01",2009,16,10,null,"2025-01-03",null,null,null,null,null,null,null,null,null,null,null,null,null,null,null,null,null,null,null,null,null,null,null,null,null,null,null,null,null,null,null,null,null,null,null,null,null,null,null,null,null,null,null,null,null,0,0]
[0,0,0,0,0,0,0,0,"VETERANO",null,"GARCÍA SEGADO","RODRIGO","RODRIGO GARCÍA SEGADO",null,null,1900,125,1,null,"2025-01-03",null,"C. DE REMO RETIRO 66",null,null,null,null,null,null,null,null,null,null,null,null,null,null,null,null,null,null,null,null,null,null,null,null,null,null,null,null,null,null,null,null,null,null,null,null,null,null,null,null,null,null,null,0,0]
[0,0,0,0,0,0,0,0,"VETERANO",null,"SILVA CASAL","ROI","ROI SILVA CASAL","78907301M","1987-02-17",1987,38,2,null,"2025-01-03",null,null,null,null,null,null,null,null,null,null,null,null,null,null,null,null,null,null,null,null,null,null,null,null,null,null,null,null,null,null,null,null,null,null,null,null,null,null,null,null,null,null,null,null,null,0,0]
[0,0,0,0,0,0,0,0,"VETERANO",null,"RÍOS LÓPEZ","ROSA","ROSA RÍOS LÓPEZ","17209573F","1961-02-06",1961,64,2,null,"2025-01-03",null,null,null,null,null,null,null,null,null,null,null,null,null,null,null,null,null,null,null,null,null,null,null,null,null,null,null,null,null,null,null,null,null,null,null,null,null,null,null,null,null,null,null,null,null,0,0]
[0,0,0,0,0,0,0,0,"SENIOR",null,"PELEGRÍN ROMERO","RUBÉN","RUBÉN PELEGRÍN ROMERO","73012972R","1999-01-12",1999,26,1,null,"2025-01-03",null,null,null,null,null,null,null,null,null,null,null,null,null,null,null,null,null,null,null,null,null,null,null,null,null,null,null,null,null,null,null,null,null,null,null,null,null,null,null,null,null,null,null,null,null,0,0]
[0,0,0,0,0,0,0,0,{"$f":"IF((Q584<11),\"BENJAMIN\",IF(OR(Q584=11,Q584=12),\"ALEVIN\",IF(OR(Q584=13,Q584=14),\"INFANTIL\",IF(OR(Q584=15,Q584=16),\"CADETE\",IF(OR(Q584=17,Q584=18),\"JUVENIL\",IF(AND(Q584>18,Q584<31),\"SENIOR\",\"VETERANO\"))))))","v":"INFANTIL"},null,"SÁNCHEZ LLOP","RUBÉN","RUBÉN SÁNCHEZ LLOP","09826394N","2011-11-01",2011,14,11,null,"2025-01-03",null,null,null,null,null,null,null,null,null,null,null,null,null,null,null,null,null,null,null,null,null,null,null,null,null,null,null,null,null,null,null,null,null,null,null,null,null,null,null,null,null,null,null,null,null,0,0]
[0,0,0,0,0,0,0,0,"VETERANO",null,"ESTEBAN MARÍN","RUTH","RUTH ESTEBAN MARÍN","25471902T","1977-07-11",1977,48,7,null,"2025-01-03",null,null,null,null,null,null,null,null,null,null,null,null,null,null,null,null,null,null,null,null,null,null,null,null,null,null,null,null,null,null,null,null,null,null,null,null,null,null,null,null,null,null,null,null,null,0,0]
[0,0,0,0,0,0,0,0,"JUVENIL",null,"BERGES ISAM-ALÍ","SALMA","SALMA BERGES ISAM-ALÍ","25364246F","2007-10-23",2007,18,10,null,"2025-01-03",null,null,null,null,null,null,null,null,null,null,null,null,null,null,null,null,null,null,null,null,null,null,null,null,null,null,null,null,null,null,null,null,null,null,null,null,null,null,null,null,null,null,null,null,null,0,0]
[0,0,0,0,0,0,0,0,"SENIOR",null,"BLACKALLER MARTÍNEZ","SANTIAGO","SANTIAGO BLACKALLER MARTÍNEZ","NO TIENE","2005-08-02",2005,20,8,null,"2025-01-03",null,null,null,null,null,null,null,null,null,null,null,null,null,null,null,null,null,null,null,null,null,null,null,null,null,null,null,null,null,null,null,null,null,null,null,null,null,null,null,null,null,null,null,null,null,0,0]
[0,0,0,0,0,0,0,0,"JUVENIL",null,"LACASTA TORRES","SANTIAGO","SANTIAGO LACASTA TORRES","73425249A","2008-02-13",2008,17,2,null,"2025-01-03",null,null,null,null,null,null,null,null,null,null,null,null,null,null,null,null,null,null,null,null,null,null,null,null,null,null,null,null,null,null,null,null,null,null,null,null,null,null,null,null,null,null,null,null,null,0,0]
[0,0,0,0,0,0,0,0,"VETERANO",null,"BUIL LANGARITA","SARA","SARA BUIL LANGARITA","25458487V","1974-09-10",1974,51,9,null,"2025-01-03",null,null,null,null,null,null,null,null,null,null,null,null,null,null,null,null,null,null,null,null,null,null,null,null,null,null,null,null,null,null,null,null,null,null,null,null,null,null,null,null,null,null,null,null,null,0,0]
[0,0,0,0,0,0,0,0,"SENIOR",null,"EPGORGI ZOUGARI","SARA","SARA EPGORGI ZOUGARI","73443617V","2006-02-11",2006,19,2,null,"2025-01-03",null,null,null,null,null,null,null,null,null,null,null,null,null,null,null,null,null,null,null,null,null,null,null,null,null,null,null,null,null,null,null,null,null,null,null,null,null,null,null,null,null,null,null,null,null,0,0]
[0,0,0,0,0,0,0,0,"SENIOR",null,"GRESA MUÑOZ","SARA","SARA GRESA MUÑOZ","25202675B","2001-04-08",2001,24,4,null,"2025-01-03",null,null,null,null,null,null,null,null,null,null,null,null,null,null,null,null,null,null,null,null,null,null,null,null,null,null,null,null,null,null,null,null,null,null,null,null,null,null,null,null,null,null,null,null,null,0,0]
[0,0,0,0,0,0,0,0,"VETERANO",null,"MARTÍNEZ GARCÍA","SARA","SARA MARTÍNEZ GARCÍA","50741774W","1978-05-27",1978,47,5,null,"2025-01-03",null,null,null,null,null,null,null,null,null,null,null,null,null,null,null,null,null,null,null,null,null,null,null,null,null,null,null,null,null,null,null,null,null,null,null,null,null,null,null,null,null,null,null,null,null,0,0]
[0,0,0,0,0,0,0,0,"SENIOR",null,"LUNA VALOROSO","SEBASTIÁN ALEJANDRO","SEBASTIÁN ALEJANDRO LUNA VALOROSO","77215326W","2006-08-07",2006,19,8,null,"2025-01-03",null,null,null,null,null,null,null,null,null,null,null,null,null,null,null,null,null,null,null,null,null,null,null,null,null,null,null,null,null,null,null,null,null,null,null,null,null,null,null,null,null,null,null,null,null,0,0]
[0,0,0,0,0,0,0,0,"VETERANO",null,"PALACÍN ARTIGOSA","SELMA","SELMA PALACÍN ARTIGOSA","17753813K","1981-09-17",1981,44,9,null,"2025-01-03",null,null,null,null,null,null,null,null,null,null,null,null,null,null,null,null,null,null,null,null,null,null,null,null,null,null,null,null,null,null,null,null,null,null,null,null,null,null,null,null,null,null,null,null,null,0,0]
[0,0,0,0,0,0,0,0,"VETERANO",null,"AURED ANTÓN","SERGIO","SERGIO AURED ANTÓN","25483490L","1978-06-11",1978,47,6,null,"2025-01-03",null,null,null,null,null,null,null,null,null,null,null,null,null,null,null,null,null,null,null,null,null,null,null,null,null,null,null,null,null,null,null,null,null,null,null,null,null,null,null,null,null,null,null,null,null,0,0]
[0,0,0,0,0,0,0,0,"SENIOR",null,"LORENTE CORTÉS","SERGIO","SERGIO LORENTE CORTÉS","77216749E","2000-05-13",2000,25,5,null,"2025-01-03",null,null,null,null,null,null,null,null,null,null,null,null,null,null,null,null,null,null,null,null,null,null,null,null,null,null,null,null,null,null,null,null,null,null,null,null,null,null,null,null,null,null,null,null,null,0,0]
[0,0,0,0,0,0,0,0,"SENIOR",null,"MAGALLÓN TEJERO","SERGIO","SERGIO MAGALLÓN TEJERO","73019816Z","1998-09-14",1998,27,9,null,"2025-01-03",null,null,null,null,null,null,null,null,null,null,null,null,null,null,null,null,null,null,null,null,null,null,null,null,null,null,null,null,null,null,null,null,null,null,null,null,null,null,null,null,null,null,null,null,null,0,0]
[0,0,0,0,0,0,0,0,"JUVENIL",null,"ROY PARLANTE","SHEILA","SHEILA ROY PARLANTE","73440837C","2007-10-15",2007,18,10,null,"2025-01-03",null,null,null,null,null,null,null,null,null,null,null,null,null,null,null,null,null,null,null,null,null,null,null,null,null,null,null,null,null,null,null,null,null,null,null,null,null,null,null,null,null,null,null,null,null,0,0]
[0,0,0,0,0,0,0,0,"SENIOR",null,"GIMBEL-SHERR","SHELTER SASKIA","SHELTER SASKIA GIMBEL-SHERR",566571373,"2004-06-30",2004,21,6,null,"2025-01-03",null,null,null,null,null,null,null,null,null,null,null,null,null,null,null,null,null,null,null,null,null,null,null,null,null,null,null,null,null,null,null,null,null,null,null,null,null,null,null,null,null,null,null,null,null,0,0]
[0,0,0,0,0,0,0,0,"VETERANO",null,"BLÁZQUEZ UGALDE","SOFÍA","SOFÍA BLÁZQUEZ UGALDE",null,null,1900,125,1,null,"2025-01-03",null,"C. DE REMO RETIRO 66",null,null,null,null,null,null,null,null,null,null,null,null,null,null,null,null,null,null,null,null,null,null,null,null,null,null,null,null,null,null,null,null,null,null,null,null,null,null,null,null,null,null,null,0,0]
[0,0,0,0,0,0,0,0,"SENIOR",null,"IBARZ TEIRA","SOFÍA","SOFÍA IBARZ TEIRA","73104897H","2003-12-13",2003,22,12,null,"2025-01-03",null,null,null,null,null,null,null,null,null,null,null,null,null,null,null,null,null,null,null,null,null,null,null,null,null,null,null,null,null,null,null,null,null,null,null,null,null,null,null,null,null,null,null,null,null,0,0]
[0,0,0,0,0,0,0,0,"JUVENIL",null,"MURZAKOVA","SOFÍA","SOFÍA MURZAKOVA","Y8303117Q","2008-11-23",2008,17,11,null,"2025-01-03",null,null,null,null,null,null,null,null,null,null,null,null,null,null,null,null,null,null,null,null,null,null,null,null,null,null,null,null,null,null,null,null,null,null,null,null,null,null,null,null,null,null,null,null,null,0,0]
[0,0,0,0,0,0,0,0,"VETERANO",null,"RUIZ JOUVÉ","SONSOLES","SONSOLES RUIZ JOUVÉ",null,null,1900,125,1,null,"2025-01-03",null,"C. DE REMO RETIRO 66",null,null,null,null,null,null,null,null,null,null,null,null,null,null,null,null,null,null,null,null,null,null,null,null,null,null,null,null,null,null,null,null,null,null,null,null,null,null,null,null,null,null,null,0,0]
[0,0,0,0,0,0,0,0,"VETERANO",null,"CIRAC BELTRÁN","SUSANA","SUSANA CIRAC BELTRÁN","17749065B","1977-08-31",1977,48,8,null,"2025-01-03",null,null,null,null,null,null,null,null,null,null,null,null,null,null,null,null,null,null,null,null,null,null,null,null,null,null,null,null,null,null,null,null,null,null,null,null,null,null,null,null,null,null,null,null,null,0,0]
[0,0,0,0,0,0,0,0,"VETERANO",null,"LÁZARO MUÑOZ","SUSANA","SUSANA LÁZARO MUÑOZ","29120604M","1976-02-16",1976,49,2,null,"2025-01-03",null,null,null,null,null,null,null,null,null,null,null,null,null,null,null,null,null,null,null,null,null,null,null,null,null,null,null,null,null,null,null,null,null,null,null,null,null,null,null,null,null,null,null,null,null,0,0]
[0,0,0,0,0,0,0,0,"VETERANO",null,"MONTERO REGUILÓN","SUSANA","SUSANA MONTERO REGUILÓN",null,null,1900,125,1,null,"2025-01-03",null,"C. DE REMO RETIRO 66",null,null,null,null,null,null,null,null,null,null,null,null,null,null,null,null,null,null,null,null,null,null,null,null,null,null,null,null,null,null,null,null,null,null,null,null,null,null,null,null,null,null,null,0,0]
[0,0,0,0,0,0,0,0,"SENIOR",null,"PONCE USÓN","SUSANA","SUSANA PONCE USÓN","25207172T","2005-04-19",2005,20,4,null,"2025-01-03",null,null,null,null,null,null,null,null,null,null,null,null,null,null,null,null,null,null,null,null,null,null,null,null,null,null,null,null,null,null,null,null,null,null,null,null,null,null,null,null,null,null,null,null,null,0,0]
[0,0,0,0,0,0,0,0,"VETERANO",null,"SARATLIC","TAMARA",{"$f":"L608&\" \"& K608","v":"TAMARA SARATLIC"},"Y0409734A","1975-03-22",{"$f":"YEAR(O608)","v":1975},50,{"$f":"MONTH(O608)","v":3},null,"2025-01-03",null,null,null,null,null,null,null,null,null,null,null,null,null,null,null,null,null,null,null,null,null,null,null,null,null,null,null,null,null,null,null,null,null,null,null,null,null,null,null,null,null,null,null,null,null,0,0]
[0,0,0,0,0,0,0,0,"VETERANO",null,"PITT","TIMOTHY JAMES","TIMOTHY JAMES PITT","X7326701M","1969-11-04",1969,56,11,null,"2025-01-03",null,null,null,null,null,null,null,null,null,null,null,null,null,null,null,null,null,null,null,null,null,null,null,null,null,null,null,null,null,null,null,null,null,null,null,null,null,null,null,null,null,null,null,null,null,0,0]
[0,0,0,0,0,0,0,0,"SENIOR",null,"SEVIL DOMINGO","TOMÁS","TOMÁS SEVIL DOMINGO","73414795Z","2000-02-22",2000,25,2,null,"2025-01-03",null,null,null,null,null,null,null,null,null,null,null,null,null,null,null,null,null,null,null,null,null,null,null,null,null,null,null,null,null,null,null,null,null,null,null,null,null,null,null,null,null,null,null,null,null,0,0]
[0,0,0,0,0,0,0,0,"JUVENIL",null,"VILLALBA MULA","VALENTÍN","VALENTÍN VILLALBA MULA","09825414K","2008-03-03",2008,17,3,null,"2025-01-03",null,null,null,null,null,null,null,null,null,null,null,null,null,null,null,null,null,null,null,null,null,null,null,null,null,null,null,null,null,null,null,null,null,null,null,null,null,null,null,null,null,null,null,null,null,0,0]
[0,0,0,0,0,0,0,0,"INFANTIL",null,"FRISA MORET","VALENTINA ","VALENTINA  FRISA MORET","26585504B","2012-12-23",2012,13,12,null,"2025-01-03",null,null,null,null,null,null,null,null,null,null,null,null,null,null,null,null,null,null,null,null,null,null,null,null,null,null,null,null,null,null,null,null,null,null,null,null,null,null,null,null,null,null,null,null,null,0,0]
[0,0,0,0,0,0,0,0,"VETERANO",null,"DE LEÓN AZNAR","VICENTE","VICENTE DE LEÓN AZNAR","17157516E","1961-12-25",1961,64,12,null,"2025-01-03",null,null,null,null,null,null,null,null,null,null,null,null,null,null,null,null,null,null,null,null,null,null,null,null,null,null,null,null,null,null,null,null,null,null,null,null,null,null,null,null,null,null,null,null,null,0,0]
[0,0,0,0,0,0,0,0,"VETERANO",null,"CARRIÓN DE LAS HERAS","VÍCTOR","VÍCTOR CARRIÓN DE LAS HERAS","47169314V","1986-08-26",1986,39,8,null,"2025-01-03",null,null,null,null,null,null,null,null,null,null,null,null,null,null,null,null,null,null,null,null,null,null,null,null,null,null,null,null,null,null,null,null,null,null,null,null,null,null,null,null,null,null,null,null,null,0,0]
[0,0,0,0,0,0,0,0,"INFANTIL",null,"CATALÁN LLOP","VÍCTOR","VÍCTOR CATALÁN LLOP","09826493L","2011-09-14",2011,14,9,null,"2025-01-03",null,null,null,null,null,null,null,null,null,null,null,null,null,null,null,null,null,null,null,null,null,null,null,null,null,null,null,null,null,null,null,null,null,null,null,null,null,null,null,null,null,null,null,null,null,0,0]
[0,0,0,0,0,0,0,0,"SENIOR",null,"GIL GIL","VÍCTOR","VÍCTOR GIL GIL","73164655E","2004-05-26",2004,21,5,null,"2025-01-03",null,null,null,null,null,null,null,null,null,null,null,null,null,null,null,null,null,null,null,null,null,null,null,null,null,null,null,null,null,null,null,null,null,null,null,null,null,null,null,null,null,null,null,null,null,0,0]
[0,0,0,0,0,0,0,0,"SENIOR",null,"HERRAIZ LÓPEZ","VÍCTOR","VÍCTOR HERRAIZ LÓPEZ","73469741J","2001-09-08",2001,24,9,null,"2025-01-03",null,null,null,null,null,null,null,null,null,null,null,null,null,null,null,null,null,null,null,null,null,null,null,null,null,null,null,null,null,null,null,null,null,null,null,null,null,null,null,null,null,null,null,null,null,0,0]
[0,0,0,0,0,0,0,0,"INFANTIL",null,"GARCIA ESCANDE","VICTORIA","VICTORIA GARCIA ESCANDE","09826381E","2011-08-19",2011,14,8,null,"2025-01-03",null,null,null,null,null,null,null,null,null,null,null,null,null,null,null,null,null,null,null,null,null,null,null,null,null,null,null,null,null,null,null,null,null,null,null,null,null,null,null,null,null,null,null,null,null,0,0]
[0,0,0,0,0,0,0,0,"JUVENIL",null,"LAPUENTE MARTÍN","VICTORIA","VICTORIA LAPUENTE MARTÍN","25206952X","2007-07-17",2007,18,7,null,"2025-01-03",null,null,null,null,null,null,null,null,null,null,null,null,null,null,null,null,null,null,null,null,null,null,null,null,null,null,null,null,null,null,null,null,null,null,null,null,null,null,null,null,null,null,null,null,null,0,0]
[0,0,0,0,0,0,0,0,"SENIOR",null,"CHIRENO ROJAS","WANNER FRANCISCO","WANNER FRANCISCO CHIRENO ROJAS","Y2394238K","2003-03-25",2003,22,3,null,"2025-01-03",null,null,null,null,null,null,null,null,null,null,null,null,null,null,null,null,null,null,null,null,null,null,null,null,null,null,null,null,null,null,null,null,null,null,null,null,null,null,null,null,null,null,null,null,null,0,0]
[0,0,0,0,0,0,0,{"$f":"IF(I621=\"V\", 1,0)","v":0},"VETERANO",null,"ESCOBAR PERNOLETE","WILNER MANUEL","WILNER MANUEL ESCOBAR PERNOLETE","Y5288395C","1990-11-03",1990,{"$f":"$Y$1-P621","v":35},11,null,"2025-01-03",null,null,null,null,null,null,null,null,null,null,null,null,null,null,null,null,null,null,null,null,null,null,null,null,null,null,null,null,null,null,null,null,null,null,null,null,null,null,null,null,null,null,null,null,null,0,0]
[0,0,0,0,0,0,0,0,"JUVENIL",null,"GÓMEZ SALINAS","XIMENA","XIMENA GÓMEZ SALINAS","78008771Q","2007-05-12",2007,18,5,null,"2025-01-03",null,null,null,null,null,null,null,null,null,null,null,null,null,null,null,null,null,null,null,null,null,null,null,null,null,null,null,null,null,null,null,null,null,null,null,null,null,null,null,null,null,null,null,null,null,0,0]
[0,0,0,0,0,0,0,0,"INFANTIL",null,"CORTÍ BETRIÁN","YAGO","YAGO CORTÍ BETRIÁN","09825384Z","2012-08-18",2012,13,8,null,"2025-01-03",null,null,null,null,null,null,null,null,null,null,null,null,null,null,null,null,null,null,null,null,null,null,null,null,null,null,null,null,null,null,null,null,null,null,null,null,null,null,null,null,null,null,null,null,null,0,0]
[null,null,null,null,null,null,null,null,null,null,null,null,null,null,null,1900,125,1,null,"2025-01-03",null,null,null,null,null,null,null,null,null,null,null,null,null,null,null,null,null,null,null,null,null,null,null,null,null,null,null,null,null,null,null,null,null,null,null,null,null,null,null,null,null,null,null,null,null,{"$f":"AJ624+AL624+AN624+AP624+AR624+AT624+AV624+AX624+AZ624+BB624+BD624+BF624+BH624+BJ624+BL624","v":0},0]
[null,null,null,null,null,null,null,null,null,null,null,null,null,null,null,1900,125,1,null,"2025-01-03",null,null,null,null,null,null,null,null,null,null,null,null,null,null,null,null,null,null,null,null,null,null,null,null,null,null,null,null,null,null,null,null,null,null,null,null,null,null,null,null,null,null,null,null,null,0,0]
[null,null,null,null,null,null,null,null,null,null,null,null,null,null,null,1900,125,1,null,"2025-01-03",null,null,null,null,null,null,null,null,null,null,null,null,null,null,null,null,null,null,null,null,null,null,null,null,null,null,null,null,null,null,null,null,null,null,null,null,null,null,null,null,null,null,null,null,null,0,0]
[null,null,null,null,null,null,null,null,null,null,null,null,null,null,null,1900,125,1,null,"2025-01-03",null,null,null,null,null,null,null,null,null,null,null,null,null,null,null,null,null,null,null,null,null,null,null,null,null,null,null,null,null,null,null,null,null,null,null,null,null,null,null,null,null,null,null,null,null,0,0]
[null,null,null,null,null,null,null,null,null,null,null,null,null,null,null,1900,125,1,null,"2025-01-03",null,null,null,null,null,null,null,null,null,null,null,null,null,null,null,null,null,null,null,null,null,null,null,null,null,null,null,null,null,null,null,null,null,null,null,null,null,null,null,null,null,null,null,null,null,0,0]
[null,null,null,null,null,null,null,null,null,null,null,null,null,null,null,1900,125,1,null,"2025-01-03",null,null,null,null,null,null,null,null,null,null,null,null,null,null,null,null,null,null,null,null,null,null,null,null,null,null,null,null,null,null,null,null,null,null,null,null,null,null,null,null,null,null,null,null,null,0,0]
[null,null,null,null,null,null,null,null,null,null,null,null,null,null,null,1900,125,1,null,"2025-01-03",null,null,null,null,null,null,null,null,null,null,null,null,null,null,null,null,null,null,null,null,null,null,null,null,null,null,null,null,null,null,null,null,null,null,null,null,null,null,null,null,null,null,null,null,null,0,0]
[null,null,null,null,null,null,null,null,null,null,null,null,null,null,null,1900,125,1,null,"2025-01-03",null,null,null,null,null,null,null,null,null,null,null,null,null,null,null,null,null,null,null,null,null,null,null,null,null,null,null,null,null,null,null,null,null,null,null,null,null,null,null,null,null,null,null,null,null,0,0]
[null,null,null,null,null,null,null,null,null,null,null,null,null,null,null,1900,125,1,null,"2025-01-03",null,null,null,null,null,null,null,null,null,null,null,null,null,null,null,null,null,null,null,null,null,null,null,null,null,null,null,null,null,null,null,null,null,null,null,null,null,null,null,null,null,null,null,null,null,0,0]
[null,null,null,null,null,null,null,null,null,null,null,null,null,null,null,1900,125,1,null,"2025-01-03",null,null,null,null,null,null,null,null,null,null,null,null,null,null,null,null,null,null,null,null,null,null,null,null,null,null,null,null,null,null,null,null,null,null,null,null,null,null,null,null,null,null,null,null,null,0,0]
[null,null,null,null,null,null,null,null,null,null,null,null,null,null,null,1900,125,1,null,"2025-01-03",null,null,null,null,null,null,null,null,null,null,null,null,null,null,null,null,null,null,null,null,null,null,null,null,null,null,null,null,null,null,null,null,null,null,null,null,null,null,null,null,null,null,null,null,null,0,0]
[null,null,null,null,null,null,null,null,null,null,null,null,null,null,null,1900,125,1,null,"2025-01-03",null,null,null,null,null,null,null,null,null,null,null,null,null,null,null,null,null,null,null,null,null,null,null,null,null,null,null,null,null,null,null,null,null,null,null,null,null,null,null,null,null,null,null,null,null,0,0]
[null,null,null,null,null,null,null,null,null,null,null,null,null,null,null,1900,125,1,null,"2025-01-03",null,null,null,null,null,null,null,null,null,null,null,null,null,null,null,null,null,null,null,null,null,null,null,null,null,null,null,null,null,null,null,null,null,null,null,null,null,null,null,null,null,null,null,null,null,0,0]
[null,null,null,null,null,null,null,null,null,null,null,null,null,null,null,1900,125,1,null,"2025-01-03",null,null,null,null,null,null,null,null,null,null,null,null,null,null,null,null,null,null,null,null,null,null,null,null,null,null,null,null,null,null,null,null,null,null,null,null,null,null,null,null,null,null,null,null,null,0,0]
[null,null,null,null,null,null,null,null,null,null,null,null,null,null,null,1900,125,1,null,"2025-01-03",null,null,null,null,null,null,null,null,null,null,null,null,null,null,null,null,null,null,null,null,null,null,null,null,null,null,null,null,null,null,null,null,null,null,null,null,null,null,null,null,null,null,null,null,null,0,0]
[null,null,null,null,null,null,null,null,null,null,null,null,null,null,null,1900,125,1,null,"2025-01-03",null,null,null,null,null,null,null,null,null,null,null,null,null,null,null,null,null,null,null,null,null,null,null,null,null,null,null,null,null,null,null,null,null,null,null,null,null,null,null,null,null,null,null,null,null,0,0]
[null,null,null,null,null,null,null,null,null,null,null,null,null,null,null,1900,125,1,null,"2025-01-03",null,null,null,null,null,null,null,null,null,null,null,null,null,null,null,null,null,null,null,null,null,null,null,null,null,null,null,null,null,null,null,null,null,null,null,null,null,null,null,null,null,null,null,null,null,0,0]
[null,null,null,null,null,null,null,null,null,null,null,null,null,null,null,null,null,null,null,"2025-01-03"]
[null,null,null,null,null,null,null,null,null,null,null,null,null,null,null,null,null,null,null,"2025-01-03"]
[null,null,null,null,null,null,null,null,null,null,null,null,null,null,null,null,null,null,null,"2025-01-03"]
[null,null,null,null,null,null,null,null,null,null,null,null,null,null,null,null,null,null,null,"2025-01-03"]
[null,null,null,null,null,null,null,null,null,null,null,null,null,null,null,null,null,null,null,"2025-01-03"]
[null,null,null,null,null,null,null,null,null,null,null,null,null,null,null,null,null,null,null,"2025-01-03"]

{"sheet":"CLUBS","index":7,"n_rows":27,"n_cols":8,"rows_kept":27,"cut":false,"hidden":true,"merged":[]}
[]
[]
[null,"CENTRO NATACION HELIOS","NAUTICO ZARAGOZA","OS NABATERS D.F.","REMO ZARAGOZA","CAPRI MEQUINENZA","ARAGON REMO","REMO MEQUINENZA"]
[null,"BENJAMIN","BENJAMIN_NZ","BENJAMIN_NB","BENJAMIN_RZ","BENJAMIN_CM","BENJAMIN_AR","BENJAMIN_RM"]
[null,"ALEVIN","ALEVIN_NZ","ALEVIN_NB","ALEVIN_RZ","ALEVIN_CM","ALEVIN_AR","ALEVIN_RM"]
[null,"INFANTIL","INFANTIL_NZ","INFANTIL_NB","INFANTIL_RZ","INFANTIL_CM","INFANTIL_AR","INFANTIL_RM"]
[null,"CADETE","CADETE_NZ","CADETE_NB","CADETE_RZ","CADETE_CM","CADETE_AR","CADETE_RM"]
[null,"JUVENIL","JUVENIL_NZ","JUVENIL_NB","JUVENIL_RZ","JUVENIL_CM","JUVENIL_AR","JUVENIL_RM"]
[null,"SENIOR","SENIOR_NZ","SENIOR_NB","SENIOR_RZ","SENIOR_CM","SENIOR_AR","SENIOR_RM"]
[null,"VETERANO","VETERANO_NZ","VETERANO_NB","VETERANO_RZ","VETERANO_CM","VETERANO_AR","VETERANO_RM"]
[]
[]
[]
[]
[]
[]
[null,"EMBARCACIONES",null,"PUESTO"]
[null,"1x",null,1]
[null,"2x",null,2]
[null,"2-",null,3]
[null,"2+",null,4]
[null,"4x",null,5]
[null,"4-",null,6]
[null,"4+",null,7]
[null,"8+",null,8]
[null,"YOLA 4+",null,"T"]
[null,"ERGOMETRO"]

{"sheet":"ENTRE_DELEG","index":8,"n_rows":298,"n_cols":26,"rows_kept":298,"cut":false,"hidden":true,"merged":[]}
["CLUB","NOMBRE COMPLETO","LICENCIA FAR ENTRENADOR","LICENCIA FAR DELEGADO",null,null,"CLUB","LICENCIA FAR ENTRENADOR",null,null,null,"CLUB","LICENCIA FAR DELEGADO"]
["F.A.R.",{"$f":"'DATOS DEPORTISTAS'!$M$4","v":"PILAR ELVIRA ATIENZA"},{"$f":"'DATOS DEPORTISTAS'!X4","v":0},{"$f":"'DATOS DEPORTISTAS'!Y4","v":0},null,null,"CENTRO NATACION HELIOS",1,null,null,null,"CENTRO NATACION HELIOS",1]
["F.A.R.",{"$f":"'DATOS DEPORTISTAS'!M5","v":"MIGUEL GASCÓN GONZÁLEZ"},{"$f":"'DATOS DEPORTISTAS'!X5","v":1},{"$f":"'DATOS DEPORTISTAS'!Y5","v":0},null,null,"ARAGÓN REMO",1,null,null,null,"ARAGÓN REMO",1]
["F.A.R.",{"$f":"'DATOS DEPORTISTAS'!M6","v":"JOSÉ JAVIER GONZÁLEZ-ARCE LABORDA"},{"$f":"'DATOS DEPORTISTAS'!X6","v":0},{"$f":"'DATOS DEPORTISTAS'!Y6","v":0},null,null,"CAPRI MEQUINENZA",1,null,null,null,"CAPRI MEQUINENZA",1]
["F.A.R.",{"$f":"'DATOS DEPORTISTAS'!M7","v":"MARCOS GÓMEZ RODRÍGUEZ"},{"$f":"'DATOS DEPORTISTAS'!X7","v":0},{"$f":"'DATOS DEPORTISTAS'!Y7","v":0},null,null,"OS NABATERS D.F.",1,null,null,null,"OS NABATERS D.F.",1]
["F.A.R.",{"$f":"'DATOS DEPORTISTAS'!M8","v":"DANIEL CASORRÁN ROYO"},{"$f":"'DATOS DEPORTISTAS'!X8","v":0},{"$f":"'DATOS DEPORTISTAS'!Y8","v":0},null,null,"NAUTICO ZARAGOZA",1,null,null,null,"NAUTICO ZARAGOZA",1]
["F.A.R.",{"$f":"'DATOS DEPORTISTAS'!M9","v":"JOSÉ MIGUEL LLOP ROCA"},{"$f":"'DATOS DEPORTISTAS'!X9","v":0},{"$f":"'DATOS DEPORTISTAS'!Y9","v":0},null,null,"REMO ZARAGOZA",1,null,null,null,"REMO ZARAGOZA",1]
["F.A.R.",{"$f":"'DATOS DEPORTISTAS'!M10","v":"PEDRO JAVIER MORALES ALCUBIERRE"},{"$f":"'DATOS DEPORTISTAS'!X10","v":0},{"$f":"'DATOS DEPORTISTAS'!Y10","v":0},null,null,"REMO MEQUINENZA",1,null,null,null,"REMO MEQUINENZA",1]
["F.A.R.",{"$f":"'DATOS DEPORTISTAS'!M11","v":"PEDRO IGNACIO MARTÍNEZ CABELLO"},{"$f":"'DATOS DEPORTISTAS'!X11","v":0},{"$f":"'DATOS DEPORTISTAS'!Y11","v":0},null,null,"F.A.R.",1,null,null,null,"F.A.R.",1]
["F.A.R.",{"$f":"'DATOS DEPORTISTAS'!M12","v":"IGNACIO MARTÍNEZ BERMEJO"},{"$f":"'DATOS DEPORTISTAS'!X12","v":0},{"$f":"'DATOS DEPORTISTAS'!Y12","v":0},null,null,null,null,null,null,null,null,null,null,null,null,null,null,null,"CENTRO NATACION HELIOS","NÁUTICO ZARAGOZA","OS NABATERS D.F.","REMO ZARAGOZA","CAPRI MEQUINENZA","ARAGON REMO","REMO MEQUINENZA"]
["F.A.R.",{"$f":"'DATOS DEPORTISTAS'!M13","v":"MARÍA JOSÉ GALLARDO BENÍTEZ"},{"$f":"'DATOS DEPORTISTAS'!X13","v":0},{"$f":"'DATOS DEPORTISTAS'!Y13","v":0},null,null,null,null,null,null,null,null,null,null,null,null,null,null,null,"CENTRO_NATACION_HELIOS","NÁUTICO_ZARAGOZA",null,null,null,"ARAGON_REMO"]
["F.A.R.",{"$f":"'DATOS DEPORTISTAS'!M14","v":"ÁNGEL AGUILERA ANDRÉS"},{"$f":"'DATOS DEPORTISTAS'!X14","v":0},{"$f":"'DATOS DEPORTISTAS'!Y14","v":0},null,null,"CLUB","LICENCIA FAR ENTRENADOR",null,null,null,"CLUB","LICENCIA FAR DELEGADO"]
["F.A.R.",{"$f":"'DATOS DEPORTISTAS'!M15","v":"BEATRIZ CASTELLÓ AYED"},{"$f":"'DATOS DEPORTISTAS'!X15","v":0},{"$f":"'DATOS DEPORTISTAS'!Y15","v":0},null,null,{"$f":"_xlfn._xlws.FILTER($A$2:$C$505,($A$2:$A$505=G2)*($C$2:$C$505=H2),\"NO ENCONTRADO\")","v":"CENTRO NATACION HELIOS"},"ALFONSO MUNIESA FERRERO",1,null,null,{"$f":"_xlfn._xlws.FILTER($A$2:$D$505,($A$2:$A$505=L2)*($D$2:$D$505=M2),\"NO ENCONTRADO\")","v":"CENTRO NATACION HELIOS"},"ALFONSO MUNIESA FERRERO",1,1]
["F.A.R.",{"$f":"'DATOS DEPORTISTAS'!M16","v":"LLUIS ANTONI BARCELÓ LISO"},{"$f":"'DATOS DEPORTISTAS'!X16","v":0},{"$f":"'DATOS DEPORTISTAS'!Y16","v":0},null,null,"CENTRO NATACION HELIOS","ESMERALDA AGUAS GARCIA",1,null,null,"CENTRO NATACION HELIOS","JULIO BIELSA ARTIDIELLO",0,1]
["F.A.R.",{"$f":"'DATOS DEPORTISTAS'!M17","v":"BEATRIZ CUNCHILLOS PASCUAL"},{"$f":"'DATOS DEPORTISTAS'!X17","v":0},{"$f":"'DATOS DEPORTISTAS'!Y17","v":0},null,null,"CENTRO NATACION HELIOS","PABLO BRIZ ZAMORANO",1]
["F.A.R.",{"$f":"'DATOS DEPORTISTAS'!M18","v":" "},{"$f":"'DATOS DEPORTISTAS'!X18","v":0},{"$f":"'DATOS DEPORTISTAS'!Y18","v":0},null,null,"CENTRO NATACION HELIOS","IVÁN LATAS JIMÉNEZ",1]
["F.A.R.",{"$f":"'DATOS DEPORTISTAS'!M19","v":" "},{"$f":"'DATOS DEPORTISTAS'!X19","v":0},{"$f":"'DATOS DEPORTISTAS'!Y19","v":0}]
["F.A.R.",{"$f":"'DATOS DEPORTISTAS'!M20","v":" "},{"$f":"'DATOS DEPORTISTAS'!X20","v":0},{"$f":"'DATOS DEPORTISTAS'!Y20","v":0}]
["F.A.R.",{"$f":"'DATOS DEPORTISTAS'!M21","v":" "},{"$f":"'DATOS DEPORTISTAS'!X21","v":0},{"$f":"'DATOS DEPORTISTAS'!Y21","v":0}]
["F.A.R.",{"$f":"'DATOS DEPORTISTAS'!M22","v":" "},{"$f":"'DATOS DEPORTISTAS'!X22","v":0},{"$f":"'DATOS DEPORTISTAS'!Y22","v":0}]
["F.A.R.",{"$f":"'DATOS DEPORTISTAS'!M23","v":" "},{"$f":"'DATOS DEPORTISTAS'!X23","v":0},{"$f":"'DATOS DEPORTISTAS'!Y23","v":0}]
[{"$f":"'DATOS DEPORTISTAS'!V24","v":"ARAGÓN REMO"},{"$f":"'DATOS DEPORTISTAS'!M24","v":"FERNANDO CARLOS MILLÁN MAINAR"},{"$f":"'DATOS DEPORTISTAS'!X24","v":0},{"$f":"'DATOS DEPORTISTAS'!Y24","v":0}]
[{"$f":"'DATOS DEPORTISTAS'!V25","v":"ARAGÓN REMO"},{"$f":"'DATOS DEPORTISTAS'!M25","v":"SOFÍA EVA GÓMEZ GÓMEZ"},{"$f":"'DATOS DEPORTISTAS'!X25","v":0},{"$f":"'DATOS DEPORTISTAS'!Y25","v":0}]
[{"$f":"'DATOS DEPORTISTAS'!V26","v":"ARAGÓN REMO"},{"$f":"'DATOS DEPORTISTAS'!M26","v":"DAVID SAN JOSÉ SANTAMARÍA"},{"$f":"'DATOS DEPORTISTAS'!X26","v":1},{"$f":"'DATOS DEPORTISTAS'!Y26","v":0},null,null,"CLUB","LICENCIA FAR ENTRENADOR",null,null,null,"CLUB","LICENCIA FAR DELEGADO"]
[{"$f":"'DATOS DEPORTISTAS'!V27","v":"CENTRO NATACION HELIOS"},{"$f":"'DATOS DEPORTISTAS'!M27","v":"ALBERTO GARCÍA RUIZ"},{"$f":"'DATOS DEPORTISTAS'!X27","v":0},{"$f":"'DATOS DEPORTISTAS'!Y27","v":0},null,null,{"$f":"_xlfn._xlws.FILTER($A$2:$C$505,($A$2:$A$505=G3)*($C$2:$C$505=H3),\"NO ENCONTRADO\")","v":"ARAGÓN REMO"},"DAVID SAN JOSÉ SANTAMARÍA",1,null,null,{"$f":"_xlfn._xlws.FILTER($A$2:$D$505,($A$2:$A$505=L3)*($D$2:$D$505=M3),\"NO ENCONTRADO\")","v":"ARAGÓN REMO"},"CARLOS MILLÁN BLASCO",0,1]
[{"$f":"'DATOS DEPORTISTAS'!V28","v":"CENTRO NATACION HELIOS"},{"$f":"'DATOS DEPORTISTAS'!M28","v":"ALFONSO MUNIESA FERRERO"},{"$f":"'DATOS DEPORTISTAS'!X28","v":1},{"$f":"'DATOS DEPORTISTAS'!Y28","v":1}]
[{"$f":"'DATOS DEPORTISTAS'!V29","v":"CENTRO NATACION HELIOS"},{"$f":"'DATOS DEPORTISTAS'!M29","v":"ÁNGEL PERNIA OYAGA"},{"$f":"'DATOS DEPORTISTAS'!X29","v":0},{"$f":"'DATOS DEPORTISTAS'!Y29","v":0}]
[{"$f":"'DATOS DEPORTISTAS'!V30","v":"CENTRO NATACION HELIOS"},{"$f":"'DATOS DEPORTISTAS'!M30","v":"ANTONIO IBÁÑEZ CUELLO"},{"$f":"'DATOS DEPORTISTAS'!X30","v":0},{"$f":"'DATOS DEPORTISTAS'!Y30","v":0}]
[{"$f":"'DATOS DEPORTISTAS'!V31","v":"CENTRO NATACION HELIOS"},{"$f":"'DATOS DEPORTISTAS'!M31","v":"MANUEL IBÁÑEZ CUELLO"},{"$f":"'DATOS DEPORTISTAS'!X31","v":0},{"$f":"'DATOS DEPORTISTAS'!Y31","v":0}]
[{"$f":"'DATOS DEPORTISTAS'!V32","v":"CENTRO NATACION HELIOS"},{"$f":"'DATOS DEPORTISTAS'!M32","v":"IRENE ICHASO CEBADERO"},{"$f":"'DATOS DEPORTISTAS'!X32","v":0},{"$f":"'DATOS DEPORTISTAS'!Y32","v":0}]
[{"$f":"'DATOS DEPORTISTAS'!V33","v":"CENTRO NATACION HELIOS"},{"$f":"'DATOS DEPORTISTAS'!M33","v":"JONÁS CALZADA LARA"},{"$f":"'DATOS DEPORTISTAS'!X33","v":0},{"$f":"'DATOS DEPORTISTAS'!Y33","v":0}]
[{"$f":"'DATOS DEPORTISTAS'!V34","v":"CENTRO NATACION HELIOS"},{"$f":"'DATOS DEPORTISTAS'!M34","v":"MARTA PINTO SOLANA"},{"$f":"'DATOS DEPORTISTAS'!X34","v":0},{"$f":"'DATOS DEPORTISTAS'!Y34","v":0}]
[{"$f":"'DATOS DEPORTISTAS'!V35","v":"CENTRO NATACION HELIOS"},{"$f":"'DATOS DEPORTISTAS'!M35","v":"PABLO GASCÓN RAHONA"},{"$f":"'DATOS DEPORTISTAS'!X35","v":0},{"$f":"'DATOS DEPORTISTAS'!Y35","v":0}]
[{"$f":"'DATOS DEPORTISTAS'!V36","v":"CENTRO NATACION HELIOS"},{"$f":"'DATOS DEPORTISTAS'!M36","v":"TERESA GUTIÉRREZ GIMÉNEZ"},{"$f":"'DATOS DEPORTISTAS'!X36","v":0},{"$f":"'DATOS DEPORTISTAS'!Y36","v":0}]
[{"$f":"'DATOS DEPORTISTAS'!V37","v":"CAPRI MEQUINENZA"},{"$f":"'DATOS DEPORTISTAS'!M37","v":"ABRIL GONZÁLEZ GARCÍA"},{"$f":"'DATOS DEPORTISTAS'!X37","v":0},{"$f":"'DATOS DEPORTISTAS'!Y37","v":0},null,null,"CLUB","LICENCIA FAR ENTRENADOR",null,null,null,"CLUB","LICENCIA FAR DELEGADO"]
[{"$f":"'DATOS DEPORTISTAS'!V38","v":"CAPRI MEQUINENZA"},{"$f":"'DATOS DEPORTISTAS'!M38","v":"ALBA CUCHÍ NIUBÓ"},{"$f":"'DATOS DEPORTISTAS'!X38","v":0},{"$f":"'DATOS DEPORTISTAS'!Y38","v":0},null,null,{"$f":"_xlfn._xlws.FILTER($A$2:$C$505,($A$2:$A$505=G4)*($C$2:$C$505=H4),\"NO ENCONTRADO\")","v":"CAPRI MEQUINENZA"},"DAVID OLIVER CABALLÉ",1,null,null,{"$f":"_xlfn._xlws.FILTER($A$2:$D$505,($A$2:$A$505=L4)*($D$2:$D$505=M4),\"NO ENCONTRADO\")","v":"CAPRI MEQUINENZA"},"CONCEPCIÓN CASTRO ARANDA",0,1]
[{"$f":"'DATOS DEPORTISTAS'!V39","v":"CAPRI MEQUINENZA"},{"$f":"'DATOS DEPORTISTAS'!M39","v":"ALBA MARTÍNEZ CLAVERO"},{"$f":"'DATOS DEPORTISTAS'!X39","v":0},{"$f":"'DATOS DEPORTISTAS'!Y39","v":0},null,null,null,null,null,null,null,"CAPRI MEQUINENZA","JORDI CASTELLÓ ROCA",0,1]
[{"$f":"'DATOS DEPORTISTAS'!V40","v":"CAPRI MEQUINENZA"},{"$f":"'DATOS DEPORTISTAS'!M40","v":"ALEX CATALÁN MOYA"},{"$f":"'DATOS DEPORTISTAS'!X40","v":0},{"$f":"'DATOS DEPORTISTAS'!Y40","v":0},null,null,null,null,null,null,null,"CAPRI MEQUINENZA","JORGE MANUEL AGUILAR OLIVER",0,1]
[{"$f":"'DATOS DEPORTISTAS'!V41","v":"CAPRI MEQUINENZA"},{"$f":"'DATOS DEPORTISTAS'!M41","v":"ÁLEX VILELLA BERENGUER"},{"$f":"'DATOS DEPORTISTAS'!X41","v":0},{"$f":"'DATOS DEPORTISTAS'!Y41","v":0},null,null,null,null,null,null,null,"CAPRI MEQUINENZA","JULIA RAMI CASTRO",0,1]
[{"$f":"'DATOS DEPORTISTAS'!V42","v":"CAPRI MEQUINENZA"},{"$f":"'DATOS DEPORTISTAS'!M42","v":"ALFONSO PÉREZ ALONSO"},{"$f":"'DATOS DEPORTISTAS'!X42","v":0},{"$f":"'DATOS DEPORTISTAS'!Y42","v":0},null,null,null,null,null,null,null,"CAPRI MEQUINENZA","Mª CARMEN GARCÍA ARANDA",0,1]
[{"$f":"'DATOS DEPORTISTAS'!V43","v":"CAPRI MEQUINENZA"},{"$f":"'DATOS DEPORTISTAS'!M43","v":"AROA CASTELLÓ VILA"},{"$f":"'DATOS DEPORTISTAS'!X43","v":0},{"$f":"'DATOS DEPORTISTAS'!Y43","v":0},null,null,null,null,null,null,null,"CAPRI MEQUINENZA","MARÍA TERESA GODIA PI",0,1]
[{"$f":"'DATOS DEPORTISTAS'!V44","v":"CAPRI MEQUINENZA"},{"$f":"'DATOS DEPORTISTAS'!M44","v":"CARMEN RODES ESTRUGA"},{"$f":"'DATOS DEPORTISTAS'!X44","v":0},{"$f":"'DATOS DEPORTISTAS'!Y44","v":0},null,null,null,null,null,null,null,"CAPRI MEQUINENZA","MARISOL CLAVERO GARCÍA",0,1]
[{"$f":"'DATOS DEPORTISTAS'!V45","v":"CAPRI MEQUINENZA"},{"$f":"'DATOS DEPORTISTAS'!M45","v":"CONCEPCIÓN CASTRO ARANDA"},{"$f":"'DATOS DEPORTISTAS'!X45","v":0},{"$f":"'DATOS DEPORTISTAS'!Y45","v":1},null,null,null,null,null,null,null,"CAPRI MEQUINENZA","PATRYCJA JANIK",0,1]
[{"$f":"'DATOS DEPORTISTAS'!V46","v":"CAPRI MEQUINENZA"},{"$f":"'DATOS DEPORTISTAS'!M46","v":"DANIEL CUCHÍ SAGARRA"},{"$f":"'DATOS DEPORTISTAS'!X46","v":0},{"$f":"'DATOS DEPORTISTAS'!Y46","v":0},null,null,null,null,null,null,null,"CAPRI MEQUINENZA","RAQUEL CABALLÉ SILVESTRE",0,1]
[{"$f":"'DATOS DEPORTISTAS'!V47","v":"CAPRI MEQUINENZA"},{"$f":"'DATOS DEPORTISTAS'!M47","v":"DAVID OLIVER CABALLÉ"},{"$f":"'DATOS DEPORTISTAS'!X47","v":1},{"$f":"'DATOS DEPORTISTAS'!Y47","v":0},null,null,null,null,null,null,null,"CAPRI MEQUINENZA","SARA  ROMERO OLMOS",0,1]
[{"$f":"'DATOS DEPORTISTAS'!V48","v":"CAPRI MEQUINENZA"},{"$f":"'DATOS DEPORTISTAS'!M48","v":"DIEGO AGUILAR ROMERO"},{"$f":"'DATOS DEPORTISTAS'!X48","v":0},{"$f":"'DATOS DEPORTISTAS'!Y48","v":0},null,null,null,null,null,null,null,"CAPRI MEQUINENZA","PEDRO JOSÉ SERVETO PALOMAR",0,1]
[{"$f":"'DATOS DEPORTISTAS'!V49","v":"CAPRI MEQUINENZA"},{"$f":"'DATOS DEPORTISTAS'!M49","v":"ELENA STEGHERR LLOP"},{"$f":"'DATOS DEPORTISTAS'!X49","v":0},{"$f":"'DATOS DEPORTISTAS'!Y49","v":0}]
[{"$f":"'DATOS DEPORTISTAS'!V50","v":"CAPRI MEQUINENZA"},{"$f":"'DATOS DEPORTISTAS'!M50","v":"ENZO EXPÓSITO SORO"},{"$f":"'DATOS DEPORTISTAS'!X50","v":0},{"$f":"'DATOS DEPORTISTAS'!Y50","v":0}]
[{"$f":"'DATOS DEPORTISTAS'!V51","v":"CAPRI MEQUINENZA"},{"$f":"'DATOS DEPORTISTAS'!M51","v":"ESTHER ANDRÉS CARRILLO"},{"$f":"'DATOS DEPORTISTAS'!X51","v":0},{"$f":"'DATOS DEPORTISTAS'!Y51","v":0}]
[{"$f":"'DATOS DEPORTISTAS'!V52","v":"CAPRI MEQUINENZA"},{"$f":"'DATOS DEPORTISTAS'!M52","v":"GISELA HIERRO GARCÍA"},{"$f":"'DATOS DEPORTISTAS'!X52","v":0},{"$f":"'DATOS DEPORTISTAS'!Y52","v":0}]
[{"$f":"'DATOS DEPORTISTAS'!V53","v":"CAPRI MEQUINENZA"},{"$f":"'DATOS DEPORTISTAS'!M53","v":"IBAI BLAS PEÑALVER"},{"$f":"'DATOS DEPORTISTAS'!X53","v":0},{"$f":"'DATOS DEPORTISTAS'!Y53","v":0}]
[{"$f":"'DATOS DEPORTISTAS'!V54","v":"CAPRI MEQUINENZA"},{"$f":"'DATOS DEPORTISTAS'!M54","v":"IKER SANJUÁN SATORRES"},{"$f":"'DATOS DEPORTISTAS'!X54","v":0},{"$f":"'DATOS DEPORTISTAS'!Y54","v":0}]
[{"$f":"'DATOS DEPORTISTAS'!V55","v":"CAPRI MEQUINENZA"},{"$f":"'DATOS DEPORTISTAS'!M55","v":"IRATXE IBARZ BERENGUER"},{"$f":"'DATOS DEPORTISTAS'!X55","v":0},{"$f":"'DATOS DEPORTISTAS'!Y55","v":0},null,null,"CLUB","LICENCIA FAR ENTRENADOR",null,null,null,"CLUB","LICENCIA FAR DELEGADO"]
[{"$f":"'DATOS DEPORTISTAS'!V56","v":"CAPRI MEQUINENZA"},{"$f":"'DATOS DEPORTISTAS'!M56","v":"IRENE BRUNA PALAU"},{"$f":"'DATOS DEPORTISTAS'!X56","v":0},{"$f":"'DATOS DEPORTISTAS'!Y56","v":0},null,null,{"$f":"_xlfn._xlws.FILTER($A$2:$C$505,($A$2:$A$505=G5)*($C$2:$C$505=H5),\"NO ENCONTRADO\")","v":"OS NABATERS D.F."},"NAOMI SANCHO BUSTÍN",1,null,null,{"$f":"_xlfn._xlws.FILTER($A$2:$D$505,($A$2:$A$505=L5)*($D$2:$D$505=M5),\"NO ENCONTRADO\")","v":"OS NABATERS D.F."},"JORGE PONCE USÓN",0,1]
[{"$f":"'DATOS DEPORTISTAS'!V57","v":"CAPRI MEQUINENZA"},{"$f":"'DATOS DEPORTISTAS'!M57","v":"IRIA EXPÓSITO SORO"},{"$f":"'DATOS DEPORTISTAS'!X57","v":0},{"$f":"'DATOS DEPORTISTAS'!Y57","v":0},null,null,"OS NABATERS D.F.","ANTONIO ANSELMO SANCHO NAVARRO",1,null,null,"OS NABATERS D.F.","MIGUEL BEA GONZÁLEZ",0,1]
[{"$f":"'DATOS DEPORTISTAS'!V58","v":"CAPRI MEQUINENZA"},{"$f":"'DATOS DEPORTISTAS'!M58","v":"ISMAEL RAHIBI VIDALLET"},{"$f":"'DATOS DEPORTISTAS'!X58","v":0},{"$f":"'DATOS DEPORTISTAS'!Y58","v":0},null,null,"OS NABATERS D.F.","LUIS CARLOS BELLED LACASA",1,null,null,"OS NABATERS D.F.","PEDRO IGNACIO MARTÍNEZ CABELLO",0,1]
[{"$f":"'DATOS DEPORTISTAS'!V59","v":"CAPRI MEQUINENZA"},{"$f":"'DATOS DEPORTISTAS'!M59","v":"IVÁN CASTELLNOU SOROLLA"},{"$f":"'DATOS DEPORTISTAS'!X59","v":0},{"$f":"'DATOS DEPORTISTAS'!Y59","v":0},null,null,"OS NABATERS D.F.","GUILLÉN VICENTE MIRANDA",1]
[{"$f":"'DATOS DEPORTISTAS'!V60","v":"CAPRI MEQUINENZA"},{"$f":"'DATOS DEPORTISTAS'!M60","v":"IVÁN EXPÓSITO VARGAS"},{"$f":"'DATOS DEPORTISTAS'!X60","v":0},{"$f":"'DATOS DEPORTISTAS'!Y60","v":0},null,null,"OS NABATERS D.F.","ÁNGEL DE MIGUEL BENITO",1]
[{"$f":"'DATOS DEPORTISTAS'!V61","v":"CAPRI MEQUINENZA"},{"$f":"'DATOS DEPORTISTAS'!M61","v":"JOEL CHERTÓ JIMÉNEZ"},{"$f":"'DATOS DEPORTISTAS'!X61","v":0},{"$f":"'DATOS DEPORTISTAS'!Y61","v":0},null,null,"OS NABATERS D.F.","ÁNGEL BERNAL LECINA",1]
[{"$f":"'DATOS DEPORTISTAS'!V62","v":"CAPRI MEQUINENZA"},{"$f":"'DATOS DEPORTISTAS'!M62","v":"JORDI CASTELLÓ ROCA"},{"$f":"'DATOS DEPORTISTAS'!X62","v":0},{"$f":"'DATOS DEPORTISTAS'!Y62","v":1}]
[{"$f":"'DATOS DEPORTISTAS'!V63","v":"CAPRI MEQUINENZA"},{"$f":"'DATOS DEPORTISTAS'!M63","v":"JORGE MANUEL AGUILAR OLIVER"},{"$f":"'DATOS DEPORTISTAS'!X63","v":0},{"$f":"'DATOS DEPORTISTAS'!Y63","v":1}]
[{"$f":"'DATOS DEPORTISTAS'!V64","v":"CAPRI MEQUINENZA"},{"$f":"'DATOS DEPORTISTAS'!M64","v":"JULIA RAMI CASTRO"},{"$f":"'DATOS DEPORTISTAS'!X64","v":0},{"$f":"'DATOS DEPORTISTAS'!Y64","v":1}]
[{"$f":"'DATOS DEPORTISTAS'!V65","v":"CAPRI MEQUINENZA"},{"$f":"'DATOS DEPORTISTAS'!M65","v":"LORENA NOGUÉS NICOLÁS"},{"$f":"'DATOS DEPORTISTAS'!X65","v":0},{"$f":"'DATOS DEPORTISTAS'!Y65","v":0}]
[{"$f":"'DATOS DEPORTISTAS'!V66","v":"CAPRI MEQUINENZA"},{"$f":"'DATOS DEPORTISTAS'!M66","v":"LUIS ESTEVE CATALÁN"},{"$f":"'DATOS DEPORTISTAS'!X66","v":0},{"$f":"'DATOS DEPORTISTAS'!Y66","v":0}]
[{"$f":"'DATOS DEPORTISTAS'!V67","v":"CAPRI MEQUINENZA"},{"$f":"'DATOS DEPORTISTAS'!M67","v":"Mª CARMEN GARCÍA ARANDA"},{"$f":"'DATOS DEPORTISTAS'!X67","v":0},{"$f":"'DATOS DEPORTISTAS'!Y67","v":1}]
[{"$f":"'DATOS DEPORTISTAS'!V68","v":"CAPRI MEQUINENZA"},{"$f":"'DATOS DEPORTISTAS'!M68","v":"MARÍA TERESA GODIA PI"},{"$f":"'DATOS DEPORTISTAS'!X68","v":0},{"$f":"'DATOS DEPORTISTAS'!Y68","v":1},null,null,"CLUB","LICENCIA FAR ENTRENADOR",null,null,null,"CLUB","LICENCIA FAR DELEGADO"]
[{"$f":"'DATOS DEPORTISTAS'!V69","v":"CAPRI MEQUINENZA"},{"$f":"'DATOS DEPORTISTAS'!M69","v":"MARC CASTELLO VILA"},{"$f":"'DATOS DEPORTISTAS'!X69","v":0},{"$f":"'DATOS DEPORTISTAS'!Y69","v":0},null,null,{"$f":"_xlfn._xlws.FILTER($A$2:$C$505,($A$2:$A$505=G6)*($C$2:$C$505=H6),\"NO ENCONTRADO\")","v":"NO ENCONTRADO"},null,null,null,null,{"$f":"_xlfn._xlws.FILTER($A$2:$D$505,($A$2:$A$505=L6)*($D$2:$D$505=M6),\"NO ENCONTRADO\")","v":"NAUTICO ZARAGOZA"},"JOSÉ MANUEL LARROY CALVO",0,1]
[{"$f":"'DATOS DEPORTISTAS'!V70","v":"CAPRI MEQUINENZA"},{"$f":"'DATOS DEPORTISTAS'!M70","v":"MARÍA AGUILAR ROMERO"},{"$f":"'DATOS DEPORTISTAS'!X70","v":0},{"$f":"'DATOS DEPORTISTAS'!Y70","v":0}]
[{"$f":"'DATOS DEPORTISTAS'!V71","v":"CAPRI MEQUINENZA"},{"$f":"'DATOS DEPORTISTAS'!M71","v":"MARÍA ARROYO CABALLÉ"},{"$f":"'DATOS DEPORTISTAS'!X71","v":0},{"$f":"'DATOS DEPORTISTAS'!Y71","v":0}]
[{"$f":"'DATOS DEPORTISTAS'!V72","v":"CAPRI MEQUINENZA"},{"$f":"'DATOS DEPORTISTAS'!M72","v":"MARINA CATALÁN MOYA"},{"$f":"'DATOS DEPORTISTAS'!X72","v":0},{"$f":"'DATOS DEPORTISTAS'!Y72","v":0}]
[{"$f":"'DATOS DEPORTISTAS'!V73","v":"CAPRI MEQUINENZA"},{"$f":"'DATOS DEPORTISTAS'!M73","v":"MARISOL CLAVERO GARCÍA"},{"$f":"'DATOS DEPORTISTAS'!X73","v":0},{"$f":"'DATOS DEPORTISTAS'!Y73","v":1}]
[{"$f":"'DATOS DEPORTISTAS'!V74","v":"CAPRI MEQUINENZA"},{"$f":"'DATOS DEPORTISTAS'!M74","v":"MAX GUARDIOLA LOPERA"},{"$f":"'DATOS DEPORTISTAS'!X74","v":0},{"$f":"'DATOS DEPORTISTAS'!Y74","v":0}]
[{"$f":"'DATOS DEPORTISTAS'!V75","v":"CAPRI MEQUINENZA"},{"$f":"'DATOS DEPORTISTAS'!M75","v":"MIGUEL RUBIO LAMBEA"},{"$f":"'DATOS DEPORTISTAS'!X75","v":0},{"$f":"'DATOS DEPORTISTAS'!Y75","v":0}]
[{"$f":"'DATOS DEPORTISTAS'!V76","v":"CAPRI MEQUINENZA"},{"$f":"'DATOS DEPORTISTAS'!M76","v":"MIRIAM BRUNA PALAU"},{"$f":"'DATOS DEPORTISTAS'!X76","v":0},{"$f":"'DATOS DEPORTISTAS'!Y76","v":0}]
[{"$f":"'DATOS DEPORTISTAS'!V77","v":"CAPRI MEQUINENZA"},{"$f":"'DATOS DEPORTISTAS'!M77","v":"MOHAMED ADAM RAHIBI VIDALLET"},{"$f":"'DATOS DEPORTISTAS'!X77","v":0},{"$f":"'DATOS DEPORTISTAS'!Y77","v":0}]
[{"$f":"'DATOS DEPORTISTAS'!V78","v":"CAPRI MEQUINENZA"},{"$f":"'DATOS DEPORTISTAS'!M78","v":"ONA ESTRUGA LLOP"},{"$f":"'DATOS DEPORTISTAS'!X78","v":0},{"$f":"'DATOS DEPORTISTAS'!Y78","v":0}]
[{"$f":"'DATOS DEPORTISTAS'!V79","v":"CAPRI MEQUINENZA"},{"$f":"'DATOS DEPORTISTAS'!M79","v":"PATRYCJA JANIK"},{"$f":"'DATOS DEPORTISTAS'!X79","v":0},{"$f":"'DATOS DEPORTISTAS'!Y79","v":1}]
[{"$f":"'DATOS DEPORTISTAS'!V80","v":"CAPRI MEQUINENZA"},{"$f":"'DATOS DEPORTISTAS'!M80","v":"PAULA CUCHÍ NIUBÓ"},{"$f":"'DATOS DEPORTISTAS'!X80","v":0},{"$f":"'DATOS DEPORTISTAS'!Y80","v":0},null,null,"CLUB","LICENCIA FAR ENTRENADOR",null,null,null,"CLUB","LICENCIA FAR DELEGADO"]
[{"$f":"'DATOS DEPORTISTAS'!V81","v":"CAPRI MEQUINENZA"},{"$f":"'DATOS DEPORTISTAS'!M81","v":"PAULO GUIMERÁ JANIK"},{"$f":"'DATOS DEPORTISTAS'!X81","v":0},{"$f":"'DATOS DEPORTISTAS'!Y81","v":0},null,null,{"$f":"_xlfn._xlws.FILTER($A$2:$C$505,($A$2:$A$505=G7)*($C$2:$C$505=H7),\"NO ENCONTRADO\")","v":"NO ENCONTRADO"},null,null,null,null,{"$f":"_xlfn._xlws.FILTER($A$2:$D$505,($A$2:$A$505=L7)*($D$2:$D$505=M7),\"NO ENCONTRADO\")","v":"NO ENCONTRADO"}]
[{"$f":"'DATOS DEPORTISTAS'!V82","v":"CAPRI MEQUINENZA"},{"$f":"'DATOS DEPORTISTAS'!M82","v":"RAQUEL CABALLÉ SILVESTRE"},{"$f":"'DATOS DEPORTISTAS'!X82","v":0},{"$f":"'DATOS DEPORTISTAS'!Y82","v":1}]
[{"$f":"'DATOS DEPORTISTAS'!V83","v":"CAPRI MEQUINENZA"},{"$f":"'DATOS DEPORTISTAS'!M83","v":"ROSANA NIUBÓ SOROLLA"},{"$f":"'DATOS DEPORTISTAS'!X83","v":0},{"$f":"'DATOS DEPORTISTAS'!Y83","v":0}]
[{"$f":"'DATOS DEPORTISTAS'!V84","v":"CAPRI MEQUINENZA"},{"$f":"'DATOS DEPORTISTAS'!M84","v":"SARA  ROMERO OLMOS"},{"$f":"'DATOS DEPORTISTAS'!X84","v":0},{"$f":"'DATOS DEPORTISTAS'!Y84","v":1}]
[{"$f":"'DATOS DEPORTISTAS'!V85","v":"CAPRI MEQUINENZA"},{"$f":"'DATOS DEPORTISTAS'!M85","v":"SAÚL VIU NOGUÉS"},{"$f":"'DATOS DEPORTISTAS'!X85","v":0},{"$f":"'DATOS DEPORTISTAS'!Y85","v":0}]
[{"$f":"'DATOS DEPORTISTAS'!V86","v":"CAPRI MEQUINENZA"},{"$f":"'DATOS DEPORTISTAS'!M86","v":"VÍCTOR ESTRUGA GIMENO"},{"$f":"'DATOS DEPORTISTAS'!X86","v":0},{"$f":"'DATOS DEPORTISTAS'!Y86","v":0}]
[{"$f":"'DATOS DEPORTISTAS'!V87","v":"CAPRI MEQUINENZA"},{"$f":"'DATOS DEPORTISTAS'!M87","v":"VICTORIA SANTAELLA MAIRELES"},{"$f":"'DATOS DEPORTISTAS'!X87","v":0},{"$f":"'DATOS DEPORTISTAS'!Y87","v":0}]
[{"$f":"'DATOS DEPORTISTAS'!V88","v":"CAPRI MEQUINENZA"},{"$f":"'DATOS DEPORTISTAS'!M88","v":"YERAY MARTÍNEZ CLAVERO"},{"$f":"'DATOS DEPORTISTAS'!X88","v":0},{"$f":"'DATOS DEPORTISTAS'!Y88","v":0}]
[{"$f":"'DATOS DEPORTISTAS'!V89","v":"CENTRO NATACION HELIOS"},{"$f":"'DATOS DEPORTISTAS'!M89","v":"CYNTHIA MANOSALVAS PILLAJO"},{"$f":"'DATOS DEPORTISTAS'!X89","v":0},{"$f":"'DATOS DEPORTISTAS'!Y89","v":0}]
[{"$f":"'DATOS DEPORTISTAS'!V90","v":"ARAGÓN REMO"},{"$f":"'DATOS DEPORTISTAS'!M90","v":"CARLOS MILLÁN BLASCO"},{"$f":"'DATOS DEPORTISTAS'!X90","v":0},{"$f":"'DATOS DEPORTISTAS'!Y90","v":1}]
[{"$f":"'DATOS DEPORTISTAS'!V91","v":"ARAGÓN REMO"},{"$f":"'DATOS DEPORTISTAS'!M91","v":"JOSÉ MANUEL LABARTA PINILLA"},{"$f":"'DATOS DEPORTISTAS'!X91","v":0},{"$f":"'DATOS DEPORTISTAS'!Y91","v":0}]
[{"$f":"'DATOS DEPORTISTAS'!V92","v":"CENTRO NATACION HELIOS"},{"$f":"'DATOS DEPORTISTAS'!M92","v":"ESMERALDA AGUAS GARCIA"},{"$f":"'DATOS DEPORTISTAS'!X92","v":1},{"$f":"'DATOS DEPORTISTAS'!Y92","v":0},null,null,"CLUB","LICENCIA FAR ENTRENADOR",null,null,null,"CLUB","LICENCIA FAR DELEGADO"]
[{"$f":"'DATOS DEPORTISTAS'!V93","v":"CENTRO NATACION HELIOS"},{"$f":"'DATOS DEPORTISTAS'!M93","v":"IKER ALONSO ROCHE"},{"$f":"'DATOS DEPORTISTAS'!X93","v":0},{"$f":"'DATOS DEPORTISTAS'!Y93","v":0},null,null,{"$f":"_xlfn._xlws.FILTER($A$2:$C$505,($A$2:$A$505=G8)*($C$2:$C$505=H8),\"NO ENCONTRADO\")","v":"NO ENCONTRADO"},null,null,null,null,{"$f":"_xlfn._xlws.FILTER($A$2:$D$505,($A$2:$A$505=L8)*($D$2:$D$505=M8),\"NO ENCONTRADO\")","v":"NO ENCONTRADO"}]
[{"$f":"'DATOS DEPORTISTAS'!V94","v":"CENTRO NATACION HELIOS"},{"$f":"'DATOS DEPORTISTAS'!M94","v":"EVA MARÍA ANGLÉS BEL"},{"$f":"'DATOS DEPORTISTAS'!X94","v":0},{"$f":"'DATOS DEPORTISTAS'!Y94","v":0}]
[{"$f":"'DATOS DEPORTISTAS'!V95","v":"CENTRO NATACION HELIOS"},{"$f":"'DATOS DEPORTISTAS'!M95","v":"JAVIER BARRACHINA RODRÍGUEZ"},{"$f":"'DATOS DEPORTISTAS'!X95","v":0},{"$f":"'DATOS DEPORTISTAS'!Y95","v":0}]
[{"$f":"'DATOS DEPORTISTAS'!V96","v":"CENTRO NATACION HELIOS"},{"$f":"'DATOS DEPORTISTAS'!M96","v":"JULIO BIELSA ARTIDIELLO"},{"$f":"'DATOS DEPORTISTAS'!X96","v":0},{"$f":"'DATOS DEPORTISTAS'!Y96","v":1}]
[{"$f":"'DATOS DEPORTISTAS'!V97","v":"CENTRO NATACION HELIOS"},{"$f":"'DATOS DEPORTISTAS'!M97","v":"ANDRÉS BLANCO VELÁZQUEZ"},{"$f":"'DATOS DEPORTISTAS'!X97","v":0},{"$f":"'DATOS DEPORTISTAS'!Y97","v":0}]
[{"$f":"'DATOS DEPORTISTAS'!V98","v":"CENTRO NATACION HELIOS"},{"$f":"'DATOS DEPORTISTAS'!M98","v":"PABLO BRIZ ZAMORANO"},{"$f":"'DATOS DEPORTISTAS'!X98","v":1},{"$f":"'DATOS DEPORTISTAS'!Y98","v":0}]
[{"$f":"'DATOS DEPORTISTAS'!V99","v":"CENTRO NATACION HELIOS"},{"$f":"'DATOS DEPORTISTAS'!M99","v":"LUIS BUEY DE SACADURA"},{"$f":"'DATOS DEPORTISTAS'!X99","v":0},{"$f":"'DATOS DEPORTISTAS'!Y99","v":0}]
[{"$f":"'DATOS DEPORTISTAS'!V100","v":"CENTRO NATACION HELIOS"},{"$f":"'DATOS DEPORTISTAS'!M100","v":"IREK CABELLO PIETRZAK"},{"$f":"'DATOS DEPORTISTAS'!X100","v":0},{"$f":"'DATOS DEPORTISTAS'!Y100","v":0}]
[{"$f":"'DATOS DEPORTISTAS'!V101","v":"CENTRO NATACION HELIOS"},{"$f":"'DATOS DEPORTISTAS'!M101","v":"JUAN CARLOS CALAVIA RODRÍGUEZ"},{"$f":"'DATOS DEPORTISTAS'!X101","v":0},{"$f":"'DATOS DEPORTISTAS'!Y101","v":0}]
[{"$f":"'DATOS DEPORTISTAS'!V102","v":"CENTRO NATACION HELIOS"},{"$f":"'DATOS DEPORTISTAS'!M102","v":"JORGE OCTAVIO CALVO GRACIA"},{"$f":"'DATOS DEPORTISTAS'!X102","v":0},{"$f":"'DATOS DEPORTISTAS'!Y102","v":0}]
[{"$f":"'DATOS DEPORTISTAS'!V103","v":"CENTRO NATACION HELIOS"},{"$f":"'DATOS DEPORTISTAS'!M103","v":"ADRIÁN CASAS GUILLÉN"},{"$f":"'DATOS DEPORTISTAS'!X103","v":0},{"$f":"'DATOS DEPORTISTAS'!Y103","v":0},null,null,"C_TODOS","LICENCIA FAR ENTRENADOR",null,null,null,"C_TODOS","LICENCIA FAR DELEGADO"]
[{"$f":"'DATOS DEPORTISTAS'!V104","v":"CENTRO NATACION HELIOS"},{"$f":"'DATOS DEPORTISTAS'!M104","v":"ERIC CAZADOR SERRANO"},{"$f":"'DATOS DEPORTISTAS'!X104","v":0},{"$f":"'DATOS DEPORTISTAS'!Y104","v":0},null,null,{"$f":"_xlfn._xlws.FILTER(C_ENTRENADOR,C2:C476=H9,\"\")","v":"F.A.R."},"MIGUEL GASCÓN GONZÁLEZ",1,null,null,{"$f":"_xlfn._xlws.FILTER(C_DELEGADO,D2:D476=M9,\"\")","v":"CENTRO NATACION HELIOS"},"ALFONSO MUNIESA FERRERO",1,1]
[{"$f":"'DATOS DEPORTISTAS'!V105","v":"CENTRO NATACION HELIOS"},{"$f":"'DATOS DEPORTISTAS'!M105","v":"UDAY CAZADOR SERRANO"},{"$f":"'DATOS DEPORTISTAS'!X105","v":0},{"$f":"'DATOS DEPORTISTAS'!Y105","v":0},null,null,"ARAGÓN REMO","DAVID SAN JOSÉ SANTAMARÍA",1,null,null,"CAPRI MEQUINENZA","CONCEPCIÓN CASTRO ARANDA",0,1]
[{"$f":"'DATOS DEPORTISTAS'!V106","v":"CENTRO NATACION HELIOS"},{"$f":"'DATOS DEPORTISTAS'!M106","v":"EMILIO ANASTASIO CILLEROS BLÁZQUEZ"},{"$f":"'DATOS DEPORTISTAS'!X106","v":0},{"$f":"'DATOS DEPORTISTAS'!Y106","v":0},null,null,"CENTRO NATACION HELIOS","ALFONSO MUNIESA FERRERO",1,null,null,"CAPRI MEQUINENZA","JORDI CASTELLÓ ROCA",0,1]
[{"$f":"'DATOS DEPORTISTAS'!V107","v":"CENTRO NATACION HELIOS"},{"$f":"'DATOS DEPORTISTAS'!M107","v":"VÍCTOR CINCA GARCÍA"},{"$f":"'DATOS DEPORTISTAS'!X107","v":0},{"$f":"'DATOS DEPORTISTAS'!Y107","v":0},null,null,"CAPRI MEQUINENZA","DAVID OLIVER CABALLÉ",1,null,null,"CAPRI MEQUINENZA","JORGE MANUEL AGUILAR OLIVER",0,1]
[{"$f":"'DATOS DEPORTISTAS'!V108","v":"CENTRO NATACION HELIOS"},{"$f":"'DATOS DEPORTISTAS'!M108","v":"DIEGO DE LAS CASAS JIMÉNEZ"},{"$f":"'DATOS DEPORTISTAS'!X108","v":0},{"$f":"'DATOS DEPORTISTAS'!Y108","v":0},null,null,"CENTRO NATACION HELIOS","ESMERALDA AGUAS GARCIA",1,null,null,"CAPRI MEQUINENZA","JULIA RAMI CASTRO",0,1]
[{"$f":"'DATOS DEPORTISTAS'!V109","v":"CENTRO NATACION HELIOS"},{"$f":"'DATOS DEPORTISTAS'!M109","v":"ANDRÉS DÍAZ ROBLES"},{"$f":"'DATOS DEPORTISTAS'!X109","v":0},{"$f":"'DATOS DEPORTISTAS'!Y109","v":0},null,null,"CENTRO NATACION HELIOS","PABLO BRIZ ZAMORANO",1,null,null,"CAPRI MEQUINENZA","Mª CARMEN GARCÍA ARANDA",0,1]
[{"$f":"'DATOS DEPORTISTAS'!V110","v":"CENTRO NATACION HELIOS"},{"$f":"'DATOS DEPORTISTAS'!M110","v":"PEDRO DIEZ GARCÍA"},{"$f":"'DATOS DEPORTISTAS'!X110","v":0},{"$f":"'DATOS DEPORTISTAS'!Y110","v":0},null,null,"CENTRO NATACION HELIOS","IVÁN LATAS JIMÉNEZ",1,null,null,"CAPRI MEQUINENZA","MARÍA TERESA GODIA PI",0,1]
[{"$f":"'DATOS DEPORTISTAS'!V111","v":"CENTRO NATACION HELIOS"},{"$f":"'DATOS DEPORTISTAS'!M111","v":"ALFREDO DIEZ SECO"},{"$f":"'DATOS DEPORTISTAS'!X111","v":0},{"$f":"'DATOS DEPORTISTAS'!Y111","v":0},null,null,"OS NABATERS D.F.","NAOMI SANCHO BUSTÍN",1,null,null,"CAPRI MEQUINENZA","MARISOL CLAVERO GARCÍA",0,1]
[{"$f":"'DATOS DEPORTISTAS'!V112","v":"CENTRO NATACION HELIOS"},{"$f":"'DATOS DEPORTISTAS'!M112","v":"JIMENA ESPADA CIPRÉS"},{"$f":"'DATOS DEPORTISTAS'!X112","v":0},{"$f":"'DATOS DEPORTISTAS'!Y112","v":0},null,null,"OS NABATERS D.F.","ANTONIO ANSELMO SANCHO NAVARRO",1,null,null,"CAPRI MEQUINENZA","PATRYCJA JANIK",0,1]
[{"$f":"'DATOS DEPORTISTAS'!V113","v":"CENTRO NATACION HELIOS"},{"$f":"'DATOS DEPORTISTAS'!M113","v":"VALENTINA ESPADA CIPRÉS"},{"$f":"'DATOS DEPORTISTAS'!X113","v":0},{"$f":"'DATOS DEPORTISTAS'!Y113","v":0},null,null,"OS NABATERS D.F.","LUIS CARLOS BELLED LACASA",1,null,null,"CAPRI MEQUINENZA","RAQUEL CABALLÉ SILVESTRE",0,1]
[{"$f":"'DATOS DEPORTISTAS'!V114","v":"CENTRO NATACION HELIOS"},{"$f":"'DATOS DEPORTISTAS'!M114","v":"VÍCTOR ESTEBAN GRAN"},{"$f":"'DATOS DEPORTISTAS'!X114","v":0},{"$f":"'DATOS DEPORTISTAS'!Y114","v":0},null,null,"OS NABATERS D.F.","GUILLÉN VICENTE MIRANDA",1,null,null,"CAPRI MEQUINENZA","SARA  ROMERO OLMOS",0,1]
[{"$f":"'DATOS DEPORTISTAS'!V115","v":"CENTRO NATACION HELIOS"},{"$f":"'DATOS DEPORTISTAS'!M115","v":"JOSÉ MANUEL FAÑA GRIÑÓN"},{"$f":"'DATOS DEPORTISTAS'!X115","v":0},{"$f":"'DATOS DEPORTISTAS'!Y115","v":0},null,null,"OS NABATERS D.F.","ÁNGEL DE MIGUEL BENITO",1,null,null,"ARAGÓN REMO","CARLOS MILLÁN BLASCO",0,1]
[{"$f":"'DATOS DEPORTISTAS'!V116","v":"CENTRO NATACION HELIOS"},{"$f":"'DATOS DEPORTISTAS'!M116","v":"NOA FUERTES VALLÉS"},{"$f":"'DATOS DEPORTISTAS'!X116","v":0},{"$f":"'DATOS DEPORTISTAS'!Y116","v":0},null,null,"OS NABATERS D.F.","ÁNGEL BERNAL LECINA",1,null,null,"CENTRO NATACION HELIOS","JULIO BIELSA ARTIDIELLO",0,1]
[{"$f":"'DATOS DEPORTISTAS'!V117","v":"CENTRO NATACION HELIOS"},{"$f":"'DATOS DEPORTISTAS'!M117","v":"TRISTÁN GASCÓN MARCHAL"},{"$f":"'DATOS DEPORTISTAS'!X117","v":0},{"$f":"'DATOS DEPORTISTAS'!Y117","v":0},null,null,null,null,null,null,null,"CAPRI MEQUINENZA","PEDRO JOSÉ SERVETO PALOMAR",0,1]
[{"$f":"'DATOS DEPORTISTAS'!V118","v":"CENTRO NATACION HELIOS"},{"$f":"'DATOS DEPORTISTAS'!M118","v":"MANUEL GIRONÉS BENAVENTE"},{"$f":"'DATOS DEPORTISTAS'!X118","v":0},{"$f":"'DATOS DEPORTISTAS'!Y118","v":0},null,null,null,null,null,null,null,"OS NABATERS D.F.","JORGE PONCE USÓN",0,1]
[{"$f":"'DATOS DEPORTISTAS'!V119","v":"CENTRO NATACION HELIOS"},{"$f":"'DATOS DEPORTISTAS'!M119","v":"GUILLERMO GUTIÉRREZ ANDOLZ"},{"$f":"'DATOS DEPORTISTAS'!X119","v":0},{"$f":"'DATOS DEPORTISTAS'!Y119","v":0},null,null,null,null,null,null,null,"OS NABATERS D.F.","MIGUEL BEA GONZÁLEZ",0,1]
[{"$f":"'DATOS DEPORTISTAS'!V120","v":"CENTRO NATACION HELIOS"},{"$f":"'DATOS DEPORTISTAS'!M120","v":"IAGO IGLESIAS DELGADO"},{"$f":"'DATOS DEPORTISTAS'!X120","v":0},{"$f":"'DATOS DEPORTISTAS'!Y120","v":0},null,null,null,null,null,null,null,"NAUTICO ZARAGOZA","JOSÉ MANUEL LARROY CALVO",0,1]
[{"$f":"'DATOS DEPORTISTAS'!V121","v":"CENTRO NATACION HELIOS"},{"$f":"'DATOS DEPORTISTAS'!M121","v":"DIEGO JIMÉNEZ HORNOS"},{"$f":"'DATOS DEPORTISTAS'!X121","v":0},{"$f":"'DATOS DEPORTISTAS'!Y121","v":0},null,null,null,null,null,null,null,"OS NABATERS D.F.","PEDRO IGNACIO MARTÍNEZ CABELLO",0,1]
[{"$f":"'DATOS DEPORTISTAS'!V122","v":"CENTRO NATACION HELIOS"},{"$f":"'DATOS DEPORTISTAS'!M122","v":"ALEXANDER JURADO PÉREZ"},{"$f":"'DATOS DEPORTISTAS'!X122","v":0},{"$f":"'DATOS DEPORTISTAS'!Y122","v":0}]
[{"$f":"'DATOS DEPORTISTAS'!V123","v":"CENTRO NATACION HELIOS"},{"$f":"'DATOS DEPORTISTAS'!M123","v":"JOSÉ LACASTA AISA"},{"$f":"'DATOS DEPORTISTAS'!X123","v":0},{"$f":"'DATOS DEPORTISTAS'!Y123","v":0}]
[{"$f":"'DATOS DEPORTISTAS'!V124","v":"CENTRO NATACION HELIOS"},{"$f":"'DATOS DEPORTISTAS'!M124","v":"FRANCISCO DE ASÍS LACRUZ SANZ"},{"$f":"'DATOS DEPORTISTAS'!X124","v":0},{"$f":"'DATOS DEPORTISTAS'!Y124","v":0}]
[{"$f":"'DATOS DEPORTISTAS'!V125","v":"CENTRO NATACION HELIOS"},{"$f":"'DATOS DEPORTISTAS'!M125","v":"IVÁN LATAS JIMÉNEZ"},{"$f":"'DATOS DEPORTISTAS'!X125","v":1},{"$f":"'DATOS DEPORTISTAS'!Y125","v":0}]
[{"$f":"'DATOS DEPORTISTAS'!V126","v":"CENTRO NATACION HELIOS"},{"$f":"'DATOS DEPORTISTAS'!M126","v":"BRUNO LÁZARO QUÍLEZ"},{"$f":"'DATOS DEPORTISTAS'!X126","v":0},{"$f":"'DATOS DEPORTISTAS'!Y126","v":0}]
[{"$f":"'DATOS DEPORTISTAS'!V127","v":"CENTRO NATACION HELIOS"},{"$f":"'DATOS DEPORTISTAS'!M127","v":"JUAN LERMA IRURETA"},{"$f":"'DATOS DEPORTISTAS'!X127","v":0},{"$f":"'DATOS DEPORTISTAS'!Y127","v":0}]
[{"$f":"'DATOS DEPORTISTAS'!V128","v":"CENTRO NATACION HELIOS"},{"$f":"'DATOS DEPORTISTAS'!M128","v":"ALICIA LUNA MONTAGUD"},{"$f":"'DATOS DEPORTISTAS'!X128","v":0},{"$f":"'DATOS DEPORTISTAS'!Y128","v":0}]
[{"$f":"'DATOS DEPORTISTAS'!V129","v":"CENTRO NATACION HELIOS"},{"$f":"'DATOS DEPORTISTAS'!M129","v":"JORGE LUNA MONTAGUD"},{"$f":"'DATOS DEPORTISTAS'!X129","v":0},{"$f":"'DATOS DEPORTISTAS'!Y129","v":0}]
[{"$f":"'DATOS DEPORTISTAS'!V130","v":"CENTRO NATACION HELIOS"},{"$f":"'DATOS DEPORTISTAS'!M130","v":"PABLO MALO VELA"},{"$f":"'DATOS DEPORTISTAS'!X130","v":0},{"$f":"'DATOS DEPORTISTAS'!Y130","v":0}]
[{"$f":"'DATOS DEPORTISTAS'!V131","v":"CENTRO NATACION HELIOS"},{"$f":"'DATOS DEPORTISTAS'!M131","v":"PILAR MARCÉN GUTIÉRREZ"},{"$f":"'DATOS DEPORTISTAS'!X131","v":0},{"$f":"'DATOS DEPORTISTAS'!Y131","v":0}]
[{"$f":"'DATOS DEPORTISTAS'!V132","v":"CENTRO NATACION HELIOS"},{"$f":"'DATOS DEPORTISTAS'!M132","v":"NIL MARTÍN BERNARDOS"},{"$f":"'DATOS DEPORTISTAS'!X132","v":0},{"$f":"'DATOS DEPORTISTAS'!Y132","v":0}]
[{"$f":"'DATOS DEPORTISTAS'!V133","v":"CENTRO NATACION HELIOS"},{"$f":"'DATOS DEPORTISTAS'!M133","v":"FERNANDO MARTÍN RANERA"},{"$f":"'DATOS DEPORTISTAS'!X133","v":0},{"$f":"'DATOS DEPORTISTAS'!Y133","v":0}]
[{"$f":"'DATOS DEPORTISTAS'!V134","v":"CENTRO NATACION HELIOS"},{"$f":"'DATOS DEPORTISTAS'!M134","v":"MARCO MELÉNDEZ DEL PICO"},{"$f":"'DATOS DEPORTISTAS'!X134","v":0},{"$f":"'DATOS DEPORTISTAS'!Y134","v":0}]
[{"$f":"'DATOS DEPORTISTAS'!V135","v":"CENTRO NATACION HELIOS"},{"$f":"'DATOS DEPORTISTAS'!M135","v":"CHLOÉ MILLÁN GÓMEZ"},{"$f":"'DATOS DEPORTISTAS'!X135","v":0},{"$f":"'DATOS DEPORTISTAS'!Y135","v":0}]
[{"$f":"'DATOS DEPORTISTAS'!V136","v":"CENTRO NATACION HELIOS"},{"$f":"'DATOS DEPORTISTAS'!M136","v":"MARTÍN MILLÁN GÓMEZ"},{"$f":"'DATOS DEPORTISTAS'!X136","v":0},{"$f":"'DATOS DEPORTISTAS'!Y136","v":0}]
[{"$f":"'DATOS DEPORTISTAS'!V137","v":"CENTRO NATACION HELIOS"},{"$f":"'DATOS DEPORTISTAS'!M137","v":"LUCÍA MONTANER ALFARO"},{"$f":"'DATOS DEPORTISTAS'!X137","v":0},{"$f":"'DATOS DEPORTISTAS'!Y137","v":0}]
[{"$f":"'DATOS DEPORTISTAS'!V138","v":"CENTRO NATACION HELIOS"},{"$f":"'DATOS DEPORTISTAS'!M138","v":"MARTÍN MONTANER ALFARO"},{"$f":"'DATOS DEPORTISTAS'!X138","v":0},{"$f":"'DATOS DEPORTISTAS'!Y138","v":0}]
[{"$f":"'DATOS DEPORTISTAS'!V139","v":"CENTRO NATACION HELIOS"},{"$f":"'DATOS DEPORTISTAS'!M139","v":"SOFÍA MONTANER ALFARO"},{"$f":"'DATOS DEPORTISTAS'!X139","v":0},{"$f":"'DATOS DEPORTISTAS'!Y139","v":0}]
[{"$f":"'DATOS DEPORTISTAS'!V140","v":"CENTRO NATACION HELIOS"},{"$f":"'DATOS DEPORTISTAS'!M140","v":"RAFAEL MONTANER MARTÍN"},{"$f":"'DATOS DEPORTISTAS'!X140","v":0},{"$f":"'DATOS DEPORTISTAS'!Y140","v":0}]
[{"$f":"'DATOS DEPORTISTAS'!V141","v":"CENTRO NATACION HELIOS"},{"$f":"'DATOS DEPORTISTAS'!M141","v":"JORGE PEIRÓ MESA"},{"$f":"'DATOS DEPORTISTAS'!X141","v":0},{"$f":"'DATOS DEPORTISTAS'!Y141","v":0}]
[{"$f":"'DATOS DEPORTISTAS'!V142","v":"CENTRO NATACION HELIOS"},{"$f":"'DATOS DEPORTISTAS'!M142","v":"MARÍA PILAR PEÑA HERRERO"},{"$f":"'DATOS DEPORTISTAS'!X142","v":0},{"$f":"'DATOS DEPORTISTAS'!Y142","v":0}]
[{"$f":"'DATOS DEPORTISTAS'!V143","v":"CENTRO NATACION HELIOS"},{"$f":"'DATOS DEPORTISTAS'!M143","v":"IVÁN PÉREZ RODRÍGUEZ"},{"$f":"'DATOS DEPORTISTAS'!X143","v":0},{"$f":"'DATOS DEPORTISTAS'!Y143","v":0}]
[{"$f":"'DATOS DEPORTISTAS'!V144","v":"CENTRO NATACION HELIOS"},{"$f":"'DATOS DEPORTISTAS'!M144","v":"MIGUEL ÁNGEL PÉREZ VICENTE"},{"$f":"'DATOS DEPORTISTAS'!X144","v":0},{"$f":"'DATOS DEPORTISTAS'!Y144","v":0}]
[{"$f":"'DATOS DEPORTISTAS'!V145","v":"CENTRO NATACION HELIOS"},{"$f":"'DATOS DEPORTISTAS'!M145","v":"GREGORIO PRADAS QUERO"},{"$f":"'DATOS DEPORTISTAS'!X145","v":0},{"$f":"'DATOS DEPORTISTAS'!Y145","v":0}]
[{"$f":"'DATOS DEPORTISTAS'!V146","v":"CENTRO NATACION HELIOS"},{"$f":"'DATOS DEPORTISTAS'!M146","v":"ADELA RELANCIO PASTOR"},{"$f":"'DATOS DEPORTISTAS'!X146","v":0},{"$f":"'DATOS DEPORTISTAS'!Y146","v":0}]
[{"$f":"'DATOS DEPORTISTAS'!V147","v":"CENTRO NATACION HELIOS"},{"$f":"'DATOS DEPORTISTAS'!M147","v":"ALMA RELANCIO PASTOR"},{"$f":"'DATOS DEPORTISTAS'!X147","v":0},{"$f":"'DATOS DEPORTISTAS'!Y147","v":0}]
[{"$f":"'DATOS DEPORTISTAS'!V148","v":"CENTRO NATACION HELIOS"},{"$f":"'DATOS DEPORTISTAS'!M148","v":"ÁNGELA RELANCIO PASTOR"},{"$f":"'DATOS DEPORTISTAS'!X148","v":0},{"$f":"'DATOS DEPORTISTAS'!Y148","v":0}]
[{"$f":"'DATOS DEPORTISTAS'!V149","v":"CENTRO NATACION HELIOS"},{"$f":"'DATOS DEPORTISTAS'!M149","v":"JAVIER REMACHA PUSCO"},{"$f":"'DATOS DEPORTISTAS'!X149","v":0},{"$f":"'DATOS DEPORTISTAS'!Y149","v":0}]
[{"$f":"'DATOS DEPORTISTAS'!V150","v":"CENTRO NATACION HELIOS"},{"$f":"'DATOS DEPORTISTAS'!M150","v":"KARLA REMACHA PUSCO"},{"$f":"'DATOS DEPORTISTAS'!X150","v":0},{"$f":"'DATOS DEPORTISTAS'!Y150","v":0}]
[{"$f":"'DATOS DEPORTISTAS'!V151","v":"CENTRO NATACION HELIOS"},{"$f":"'DATOS DEPORTISTAS'!M151","v":"MARÍA ROMEO VICENTE"},{"$f":"'DATOS DEPORTISTAS'!X151","v":0},{"$f":"'DATOS DEPORTISTAS'!Y151","v":0}]
[{"$f":"'DATOS DEPORTISTAS'!V152","v":"CENTRO NATACION HELIOS"},{"$f":"'DATOS DEPORTISTAS'!M152","v":"ÁNGEL ROYO LAVILLA"},{"$f":"'DATOS DEPORTISTAS'!X152","v":0},{"$f":"'DATOS DEPORTISTAS'!Y152","v":0}]
[{"$f":"'DATOS DEPORTISTAS'!V153","v":"CENTRO NATACION HELIOS"},{"$f":"'DATOS DEPORTISTAS'!M153","v":"RUTH SÁEZ LARREA"},{"$f":"'DATOS DEPORTISTAS'!X153","v":0},{"$f":"'DATOS DEPORTISTAS'!Y153","v":0}]
[{"$f":"'DATOS DEPORTISTAS'!V154","v":"CENTRO NATACION HELIOS"},{"$f":"'DATOS DEPORTISTAS'!M154","v":"JUAN JOSÉ SALAS IBÁÑEZ"},{"$f":"'DATOS DEPORTISTAS'!X154","v":0},{"$f":"'DATOS DEPORTISTAS'!Y154","v":0}]
[{"$f":"'DATOS DEPORTISTAS'!V155","v":"CENTRO NATACION HELIOS"},{"$f":"'DATOS DEPORTISTAS'!M155","v":"JOSÉ TABUENCA COLERA"},{"$f":"'DATOS DEPORTISTAS'!X155","v":0},{"$f":"'DATOS DEPORTISTAS'!Y155","v":0}]
[{"$f":"'DATOS DEPORTISTAS'!V156","v":"CENTRO NATACION HELIOS"},{"$f":"'DATOS DEPORTISTAS'!M156","v":"ISABEL TOVAR GODOY"},{"$f":"'DATOS DEPORTISTAS'!X156","v":0},{"$f":"'DATOS DEPORTISTAS'!Y156","v":0}]
[{"$f":"'DATOS DEPORTISTAS'!V157","v":"CENTRO NATACION HELIOS"},{"$f":"'DATOS DEPORTISTAS'!M157","v":"JUAN TOVAR GODOY"},{"$f":"'DATOS DEPORTISTAS'!X157","v":0},{"$f":"'DATOS DEPORTISTAS'!Y157","v":0}]
[{"$f":"'DATOS DEPORTISTAS'!V158","v":"CENTRO NATACION HELIOS"},{"$f":"'DATOS DEPORTISTAS'!M158","v":"GERMÁN VILLORO ANGLÉS"},{"$f":"'DATOS DEPORTISTAS'!X158","v":0},{"$f":"'DATOS DEPORTISTAS'!Y158","v":0}]
[{"$f":"'DATOS DEPORTISTAS'!V159","v":"CENTRO NATACION HELIOS"},{"$f":"'DATOS DEPORTISTAS'!M159","v":"ANTONIO MIGUEL VILLORO GRASKE"},{"$f":"'DATOS DEPORTISTAS'!X159","v":0},{"$f":"'DATOS DEPORTISTAS'!Y159","v":0}]
[{"$f":"'DATOS DEPORTISTAS'!V160","v":"CENTRO NATACION HELIOS"},{"$f":"'DATOS DEPORTISTAS'!M160","v":"ALICIA YÁÑEZ MARTÍNEZ"},{"$f":"'DATOS DEPORTISTAS'!X160","v":0},{"$f":"'DATOS DEPORTISTAS'!Y160","v":0}]
[{"$f":"'DATOS DEPORTISTAS'!V161","v":"CENTRO NATACION HELIOS"},{"$f":"'DATOS DEPORTISTAS'!M161","v":"ÍÑIGO MIGUEL ZAPATA LARROY"},{"$f":"'DATOS DEPORTISTAS'!X161","v":0},{"$f":"'DATOS DEPORTISTAS'!Y161","v":0}]
[{"$f":"'DATOS DEPORTISTAS'!V162","v":"CAPRI MEQUINENZA"},{"$f":"'DATOS DEPORTISTAS'!M162","v":"AARÓN MÁRQUEZ GUARDIOLA"},{"$f":"'DATOS DEPORTISTAS'!X162","v":0},{"$f":"'DATOS DEPORTISTAS'!Y162","v":0}]
[{"$f":"'DATOS DEPORTISTAS'!V163","v":"CAPRI MEQUINENZA"},{"$f":"'DATOS DEPORTISTAS'!M163","v":"ERIKA GODIA NICOLAU"},{"$f":"'DATOS DEPORTISTAS'!X163","v":0},{"$f":"'DATOS DEPORTISTAS'!Y163","v":0}]
[{"$f":"'DATOS DEPORTISTAS'!V164","v":"CAPRI MEQUINENZA"},{"$f":"'DATOS DEPORTISTAS'!M164","v":"IVÁN GODIA SANCHO"},{"$f":"'DATOS DEPORTISTAS'!X164","v":0},{"$f":"'DATOS DEPORTISTAS'!Y164","v":0}]
[{"$f":"'DATOS DEPORTISTAS'!V165","v":"CAPRI MEQUINENZA"},{"$f":"'DATOS DEPORTISTAS'!M165","v":"NOA  GARCIA SERRANO"},{"$f":"'DATOS DEPORTISTAS'!X165","v":0},{"$f":"'DATOS DEPORTISTAS'!Y165","v":0}]
[{"$f":"'DATOS DEPORTISTAS'!V166","v":"CAPRI MEQUINENZA"},{"$f":"'DATOS DEPORTISTAS'!M166","v":"SOFÍA SERVETO ORDUÑA"},{"$f":"'DATOS DEPORTISTAS'!X166","v":0},{"$f":"'DATOS DEPORTISTAS'!Y166","v":0}]
[{"$f":"'DATOS DEPORTISTAS'!V167","v":"CAPRI MEQUINENZA"},{"$f":"'DATOS DEPORTISTAS'!M167","v":"TIBERIU GABRIEL DAMIÁN"},{"$f":"'DATOS DEPORTISTAS'!X167","v":0},{"$f":"'DATOS DEPORTISTAS'!Y167","v":0}]
[{"$f":"'DATOS DEPORTISTAS'!V168","v":"CAPRI MEQUINENZA"},{"$f":"'DATOS DEPORTISTAS'!M168","v":"CARLA MARÍA TEIRA ARBIOL"},{"$f":"'DATOS DEPORTISTAS'!X168","v":0},{"$f":"'DATOS DEPORTISTAS'!Y168","v":0}]
[{"$f":"'DATOS DEPORTISTAS'!V169","v":"CAPRI MEQUINENZA"},{"$f":"'DATOS DEPORTISTAS'!M169","v":"HELENA BERNAL LACRUZ"},{"$f":"'DATOS DEPORTISTAS'!X169","v":0},{"$f":"'DATOS DEPORTISTAS'!Y169","v":0}]
[{"$f":"'DATOS DEPORTISTAS'!V170","v":"CAPRI MEQUINENZA"},{"$f":"'DATOS DEPORTISTAS'!M170","v":"JESÚS MANUEL LLOP MONTULL"},{"$f":"'DATOS DEPORTISTAS'!X170","v":0},{"$f":"'DATOS DEPORTISTAS'!Y170","v":0}]
[{"$f":"'DATOS DEPORTISTAS'!V171","v":"CAPRI MEQUINENZA"},{"$f":"'DATOS DEPORTISTAS'!M171","v":"MARCELO ITHARTE"},{"$f":"'DATOS DEPORTISTAS'!X171","v":0},{"$f":"'DATOS DEPORTISTAS'!Y171","v":0}]
[{"$f":"'DATOS DEPORTISTAS'!V172","v":"CAPRI MEQUINENZA"},{"$f":"'DATOS DEPORTISTAS'!M172","v":"MARÍA PILAR GODIA PI"},{"$f":"'DATOS DEPORTISTAS'!X172","v":0},{"$f":"'DATOS DEPORTISTAS'!Y172","v":0}]
[{"$f":"'DATOS DEPORTISTAS'!V173","v":"CAPRI MEQUINENZA"},{"$f":"'DATOS DEPORTISTAS'!M173","v":"OLIVER FERNÁNDEZ GIL"},{"$f":"'DATOS DEPORTISTAS'!X173","v":0},{"$f":"'DATOS DEPORTISTAS'!Y173","v":0}]
[{"$f":"'DATOS DEPORTISTAS'!V174","v":"CAPRI MEQUINENZA"},{"$f":"'DATOS DEPORTISTAS'!M174","v":"ROSA MARÍA LLOP RIAU"},{"$f":"'DATOS DEPORTISTAS'!X174","v":0},{"$f":"'DATOS DEPORTISTAS'!Y174","v":0}]
[{"$f":"'DATOS DEPORTISTAS'!V175","v":"CAPRI MEQUINENZA"},{"$f":"'DATOS DEPORTISTAS'!M175","v":"SARA SERVETO ORDUÑA"},{"$f":"'DATOS DEPORTISTAS'!X175","v":0},{"$f":"'DATOS DEPORTISTAS'!Y175","v":0}]
[{"$f":"'DATOS DEPORTISTAS'!V176","v":"CAPRI MEQUINENZA"},{"$f":"'DATOS DEPORTISTAS'!M176","v":"PEDRO JOSÉ SERVETO PALOMAR"},{"$f":"'DATOS DEPORTISTAS'!X176","v":0},{"$f":"'DATOS DEPORTISTAS'!Y176","v":1}]
[{"$f":"'DATOS DEPORTISTAS'!V177","v":"CENTRO NATACION HELIOS"},{"$f":"'DATOS DEPORTISTAS'!M177","v":"JIMENA ALCÁNTARA BUATAS"},{"$f":"'DATOS DEPORTISTAS'!X177","v":0},{"$f":"'DATOS DEPORTISTAS'!Y177","v":0}]
[{"$f":"'DATOS DEPORTISTAS'!V178","v":"CENTRO NATACION HELIOS"},{"$f":"'DATOS DEPORTISTAS'!M178","v":"PEDRO BENITO ARANDA MARTÍNEZ"},{"$f":"'DATOS DEPORTISTAS'!X178","v":0},{"$f":"'DATOS DEPORTISTAS'!Y178","v":0}]
[{"$f":"'DATOS DEPORTISTAS'!V179","v":"CENTRO NATACION HELIOS"},{"$f":"'DATOS DEPORTISTAS'!M179","v":"JOSÉ MANUEL BIELSA ARTIDIELLO"},{"$f":"'DATOS DEPORTISTAS'!X179","v":0},{"$f":"'DATOS DEPORTISTAS'!Y179","v":0}]
[{"$f":"'DATOS DEPORTISTAS'!V180","v":"CENTRO NATACION HELIOS"},{"$f":"'DATOS DEPORTISTAS'!M180","v":"ELOY GARCÉS BALLERTE"},{"$f":"'DATOS DEPORTISTAS'!X180","v":0},{"$f":"'DATOS DEPORTISTAS'!Y180","v":0}]
[{"$f":"'DATOS DEPORTISTAS'!V181","v":"CENTRO NATACION HELIOS"},{"$f":"'DATOS DEPORTISTAS'!M181","v":"MARGARET HONENSHLT"},{"$f":"'DATOS DEPORTISTAS'!X181","v":0},{"$f":"'DATOS DEPORTISTAS'!Y181","v":0}]
[{"$f":"'DATOS DEPORTISTAS'!V182","v":"CENTRO NATACION HELIOS"},{"$f":"'DATOS DEPORTISTAS'!M182","v":"VÍCTOR LENNIKOV IGLESIAS"},{"$f":"'DATOS DEPORTISTAS'!X182","v":0},{"$f":"'DATOS DEPORTISTAS'!Y182","v":0}]
[{"$f":"'DATOS DEPORTISTAS'!V183","v":"CENTRO NATACION HELIOS"},{"$f":"'DATOS DEPORTISTAS'!M183","v":"SYLVIA MARÍA MELO HURTADO"},{"$f":"'DATOS DEPORTISTAS'!X183","v":0},{"$f":"'DATOS DEPORTISTAS'!Y183","v":0}]
[{"$f":"'DATOS DEPORTISTAS'!V184","v":"CENTRO NATACION HELIOS"},{"$f":"'DATOS DEPORTISTAS'!M184","v":"PEDRO MARÍA NAVARRO SANGüESA"},{"$f":"'DATOS DEPORTISTAS'!X184","v":0},{"$f":"'DATOS DEPORTISTAS'!Y184","v":0}]
[{"$f":"'DATOS DEPORTISTAS'!V185","v":"CENTRO NATACION HELIOS"},{"$f":"'DATOS DEPORTISTAS'!M185","v":"JAVIER MUNIESA AGUAS"},{"$f":"'DATOS DEPORTISTAS'!X185","v":0},{"$f":"'DATOS DEPORTISTAS'!Y185","v":0}]
[{"$f":"'DATOS DEPORTISTAS'!V186","v":"CENTRO NATACION HELIOS"},{"$f":"'DATOS DEPORTISTAS'!M186","v":"JOSÉ GABRIEL SEBASTIÁN BELANCHE"},{"$f":"'DATOS DEPORTISTAS'!X186","v":0},{"$f":"'DATOS DEPORTISTAS'!Y186","v":0}]
[{"$f":"'DATOS DEPORTISTAS'!V187","v":"CENTRO NATACION HELIOS"},{"$f":"'DATOS DEPORTISTAS'!M187","v":"MARIA ÁNGELES PASTOR MONTAÑO"},{"$f":"'DATOS DEPORTISTAS'!X187","v":0},{"$f":"'DATOS DEPORTISTAS'!Y187","v":0}]
[{"$f":"'DATOS DEPORTISTAS'!V188","v":"CENTRO NATACION HELIOS"},{"$f":"'DATOS DEPORTISTAS'!M188","v":"DAVID SINUSIA LAVIL"},{"$f":"'DATOS DEPORTISTAS'!X188","v":0},{"$f":"'DATOS DEPORTISTAS'!Y188","v":0}]
[{"$f":"'DATOS DEPORTISTAS'!V189","v":"CENTRO NATACION HELIOS"},{"$f":"'DATOS DEPORTISTAS'!M189","v":"SANDRA DIEZ GARCÍA"},{"$f":"'DATOS DEPORTISTAS'!X189","v":0},{"$f":"'DATOS DEPORTISTAS'!Y189","v":0}]
[{"$f":"'DATOS DEPORTISTAS'!V190","v":"OS NABATERS D.F."},{"$f":"'DATOS DEPORTISTAS'!M190","v":"NAOMI SANCHO BUSTÍN"},{"$f":"'DATOS DEPORTISTAS'!X190","v":1},{"$f":"'DATOS DEPORTISTAS'!Y190","v":0}]
[{"$f":"'DATOS DEPORTISTAS'!V191","v":"OS NABATERS D.F."},{"$f":"'DATOS DEPORTISTAS'!M191","v":"RICARDO SALILLAS MARTÍNEZ"},{"$f":"'DATOS DEPORTISTAS'!X191","v":0},{"$f":"'DATOS DEPORTISTAS'!Y191","v":0}]
[{"$f":"'DATOS DEPORTISTAS'!V192","v":"OS NABATERS D.F."},{"$f":"'DATOS DEPORTISTAS'!M192","v":"OMAR SEBASTIÁN BUSTÍN"},{"$f":"'DATOS DEPORTISTAS'!X192","v":0},{"$f":"'DATOS DEPORTISTAS'!Y192","v":0}]
[{"$f":"'DATOS DEPORTISTAS'!V193","v":"OS NABATERS D.F."},{"$f":"'DATOS DEPORTISTAS'!M193","v":"ALODIA SANCHO BUSTÍN"},{"$f":"'DATOS DEPORTISTAS'!X193","v":0},{"$f":"'DATOS DEPORTISTAS'!Y193","v":0}]
[{"$f":"'DATOS DEPORTISTAS'!V194","v":"OS NABATERS D.F."},{"$f":"'DATOS DEPORTISTAS'!M194","v":"LUIS JAVIER MELERO PASCUAL"},{"$f":"'DATOS DEPORTISTAS'!X194","v":0},{"$f":"'DATOS DEPORTISTAS'!Y194","v":0}]
[{"$f":"'DATOS DEPORTISTAS'!V195","v":"OS NABATERS D.F."},{"$f":"'DATOS DEPORTISTAS'!M195","v":"ANTONIO ANSELMO SANCHO NAVARRO"},{"$f":"'DATOS DEPORTISTAS'!X195","v":1},{"$f":"'DATOS DEPORTISTAS'!Y195","v":0}]
[{"$f":"'DATOS DEPORTISTAS'!V196","v":"OS NABATERS D.F."},{"$f":"'DATOS DEPORTISTAS'!M196","v":"JOSÉ MARÍA EMBARBA LABORDA"},{"$f":"'DATOS DEPORTISTAS'!X196","v":0},{"$f":"'DATOS DEPORTISTAS'!Y196","v":0}]
[{"$f":"'DATOS DEPORTISTAS'!V197","v":"OS NABATERS D.F."},{"$f":"'DATOS DEPORTISTAS'!M197","v":"LUIS CARLOS BELLED LACASA"},{"$f":"'DATOS DEPORTISTAS'!X197","v":1},{"$f":"'DATOS DEPORTISTAS'!Y197","v":0}]
[{"$f":"'DATOS DEPORTISTAS'!V198","v":"OS NABATERS D.F."},{"$f":"'DATOS DEPORTISTAS'!M198","v":"ÁNGEL AGUILERA ANDRÉS"},{"$f":"'DATOS DEPORTISTAS'!X198","v":0},{"$f":"'DATOS DEPORTISTAS'!Y198","v":0}]
[{"$f":"'DATOS DEPORTISTAS'!V199","v":"OS NABATERS D.F."},{"$f":"'DATOS DEPORTISTAS'!M199","v":"PEDRO DANIEL PLOU ARTAL"},{"$f":"'DATOS DEPORTISTAS'!X199","v":0},{"$f":"'DATOS DEPORTISTAS'!Y199","v":0}]
[{"$f":"'DATOS DEPORTISTAS'!V200","v":"OS NABATERS D.F."},{"$f":"'DATOS DEPORTISTAS'!M200","v":"JOSÉ IGNACIO MAGDALENA ABAD"},{"$f":"'DATOS DEPORTISTAS'!X200","v":0},{"$f":"'DATOS DEPORTISTAS'!Y200","v":0}]
[{"$f":"'DATOS DEPORTISTAS'!V201","v":"OS NABATERS D.F."},{"$f":"'DATOS DEPORTISTAS'!M201","v":"ISCICIO NAVARRETE SÁNCHEZ"},{"$f":"'DATOS DEPORTISTAS'!X201","v":0},{"$f":"'DATOS DEPORTISTAS'!Y201","v":0}]
[{"$f":"'DATOS DEPORTISTAS'!V202","v":"OS NABATERS D.F."},{"$f":"'DATOS DEPORTISTAS'!M202","v":"ALEJANDRO DEL AMO SANCHO"},{"$f":"'DATOS DEPORTISTAS'!X202","v":0},{"$f":"'DATOS DEPORTISTAS'!Y202","v":0}]
[{"$f":"'DATOS DEPORTISTAS'!V203","v":"OS NABATERS D.F."},{"$f":"'DATOS DEPORTISTAS'!M203","v":"ADRIÁN AZNAR SAMPER"},{"$f":"'DATOS DEPORTISTAS'!X203","v":0},{"$f":"'DATOS DEPORTISTAS'!Y203","v":0}]
[{"$f":"'DATOS DEPORTISTAS'!V204","v":"OS NABATERS D.F."},{"$f":"'DATOS DEPORTISTAS'!M204","v":"SUSANA ESTABLÉS SUJÁN"},{"$f":"'DATOS DEPORTISTAS'!X204","v":0},{"$f":"'DATOS DEPORTISTAS'!Y204","v":0}]
[{"$f":"'DATOS DEPORTISTAS'!V205","v":"OS NABATERS D.F."},{"$f":"'DATOS DEPORTISTAS'!M205","v":"RAQUEL HERNÁNDEZ ROYO"},{"$f":"'DATOS DEPORTISTAS'!X205","v":0},{"$f":"'DATOS DEPORTISTAS'!Y205","v":0}]
[{"$f":"'DATOS DEPORTISTAS'!V206","v":"OS NABATERS D.F."},{"$f":"'DATOS DEPORTISTAS'!M206","v":"JESÚS MARÍA VILLAR QUINTANA"},{"$f":"'DATOS DEPORTISTAS'!X206","v":0},{"$f":"'DATOS DEPORTISTAS'!Y206","v":0}]
[{"$f":"'DATOS DEPORTISTAS'!V207","v":"OS NABATERS D.F."},{"$f":"'DATOS DEPORTISTAS'!M207","v":"JOSÉ LUIS HERNÁNDEZ PASCUAL"},{"$f":"'DATOS DEPORTISTAS'!X207","v":0},{"$f":"'DATOS DEPORTISTAS'!Y207","v":0}]
[{"$f":"'DATOS DEPORTISTAS'!V208","v":"OS NABATERS D.F."},{"$f":"'DATOS DEPORTISTAS'!M208","v":"IGNACIO HERNÁNDEZ ARAGÜET"},{"$f":"'DATOS DEPORTISTAS'!X208","v":0},{"$f":"'DATOS DEPORTISTAS'!Y208","v":0}]
[{"$f":"'DATOS DEPORTISTAS'!V209","v":"OS NABATERS D.F."},{"$f":"'DATOS DEPORTISTAS'!M209","v":"JOSÉ ÁNGEL GRACIA AGUSTÍN"},{"$f":"'DATOS DEPORTISTAS'!X209","v":0},{"$f":"'DATOS DEPORTISTAS'!Y209","v":0}]
[{"$f":"'DATOS DEPORTISTAS'!V210","v":"OS NABATERS D.F."},{"$f":"'DATOS DEPORTISTAS'!M210","v":"SARA MARTÍN RANERA"},{"$f":"'DATOS DEPORTISTAS'!X210","v":0},{"$f":"'DATOS DEPORTISTAS'!Y210","v":0}]
[{"$f":"'DATOS DEPORTISTAS'!V211","v":"OS NABATERS D.F."},{"$f":"'DATOS DEPORTISTAS'!M211","v":"GERMÁN FAUBELL MACÍA"},{"$f":"'DATOS DEPORTISTAS'!X211","v":0},{"$f":"'DATOS DEPORTISTAS'!Y211","v":0}]
[{"$f":"'DATOS DEPORTISTAS'!V212","v":"OS NABATERS D.F."},{"$f":"'DATOS DEPORTISTAS'!M212","v":"JOSÉ LUIS CAMBERO CENZANO"},{"$f":"'DATOS DEPORTISTAS'!X212","v":0},{"$f":"'DATOS DEPORTISTAS'!Y212","v":0}]
[{"$f":"'DATOS DEPORTISTAS'!V213","v":"OS NABATERS D.F."},{"$f":"'DATOS DEPORTISTAS'!M213","v":"JORGE PONCE USÓN"},{"$f":"'DATOS DEPORTISTAS'!X213","v":0},{"$f":"'DATOS DEPORTISTAS'!Y213","v":1}]
[{"$f":"'DATOS DEPORTISTAS'!V214","v":"OS NABATERS D.F."},{"$f":"'DATOS DEPORTISTAS'!M214","v":"GUILLÉN VICENTE MIRANDA"},{"$f":"'DATOS DEPORTISTAS'!X214","v":1},{"$f":"'DATOS DEPORTISTAS'!Y214","v":0}]
[{"$f":"'DATOS DEPORTISTAS'!V215","v":"OS NABATERS D.F."},{"$f":"'DATOS DEPORTISTAS'!M215","v":"MIGUEL BEA GONZÁLEZ"},{"$f":"'DATOS DEPORTISTAS'!X215","v":0},{"$f":"'DATOS DEPORTISTAS'!Y215","v":1}]
[{"$f":"'DATOS DEPORTISTAS'!V216","v":"OS NABATERS D.F."},{"$f":"'DATOS DEPORTISTAS'!M216","v":"VÍCTOR IVZHENKO"},{"$f":"'DATOS DEPORTISTAS'!X216","v":0},{"$f":"'DATOS DEPORTISTAS'!Y216","v":0}]
[{"$f":"'DATOS DEPORTISTAS'!V217","v":"OS NABATERS D.F."},{"$f":"'DATOS DEPORTISTAS'!M217","v":"MERCEDES GIMÉNEZ HERRERO"},{"$f":"'DATOS DEPORTISTAS'!X217","v":0},{"$f":"'DATOS DEPORTISTAS'!Y217","v":0}]
[{"$f":"'DATOS DEPORTISTAS'!V218","v":"OS NABATERS D.F."},{"$f":"'DATOS DEPORTISTAS'!M218","v":"ABEL RICARDO OVALLES GUERRA"},{"$f":"'DATOS DEPORTISTAS'!X218","v":0},{"$f":"'DATOS DEPORTISTAS'!Y218","v":0}]
[{"$f":"'DATOS DEPORTISTAS'!V219","v":"OS NABATERS D.F."},{"$f":"'DATOS DEPORTISTAS'!M219","v":"DAVID MARCOS GARCÍA"},{"$f":"'DATOS DEPORTISTAS'!X219","v":0},{"$f":"'DATOS DEPORTISTAS'!Y219","v":0}]
[{"$f":"'DATOS DEPORTISTAS'!V220","v":"OS NABATERS D.F."},{"$f":"'DATOS DEPORTISTAS'!M220","v":"ROBERTO NAVARRO CARRETERO"},{"$f":"'DATOS DEPORTISTAS'!X220","v":0},{"$f":"'DATOS DEPORTISTAS'!Y220","v":0}]
[{"$f":"'DATOS DEPORTISTAS'!V221","v":"OS NABATERS D.F."},{"$f":"'DATOS DEPORTISTAS'!M221","v":"DARÍO CANO JIMÉNEZ"},{"$f":"'DATOS DEPORTISTAS'!X221","v":0},{"$f":"'DATOS DEPORTISTAS'!Y221","v":0}]
[{"$f":"'DATOS DEPORTISTAS'!V222","v":"OS NABATERS D.F."},{"$f":"'DATOS DEPORTISTAS'!M222","v":"CÉSAR DÍEZ MOZOTA"},{"$f":"'DATOS DEPORTISTAS'!X222","v":0},{"$f":"'DATOS DEPORTISTAS'!Y222","v":0}]
[{"$f":"'DATOS DEPORTISTAS'!V223","v":"OS NABATERS D.F."},{"$f":"'DATOS DEPORTISTAS'!M223","v":"RAÚL DÍEZ DÍEZ"},{"$f":"'DATOS DEPORTISTAS'!X223","v":0},{"$f":"'DATOS DEPORTISTAS'!Y223","v":0}]
[{"$f":"'DATOS DEPORTISTAS'!V224","v":"OS NABATERS D.F."},{"$f":"'DATOS DEPORTISTAS'!M224","v":"DAVID OLMO NADAL"},{"$f":"'DATOS DEPORTISTAS'!X224","v":0},{"$f":"'DATOS DEPORTISTAS'!Y224","v":0}]
[{"$f":"'DATOS DEPORTISTAS'!V225","v":"OS NABATERS D.F."},{"$f":"'DATOS DEPORTISTAS'!M225","v":"ELENA CID RUIZ"},{"$f":"'DATOS DEPORTISTAS'!X225","v":0},{"$f":"'DATOS DEPORTISTAS'!Y225","v":0}]
[{"$f":"'DATOS DEPORTISTAS'!V226","v":"OS NABATERS D.F."},{"$f":"'DATOS DEPORTISTAS'!M226","v":"ANDREA MATAIX MONTANER"},{"$f":"'DATOS DEPORTISTAS'!X226","v":0},{"$f":"'DATOS DEPORTISTAS'!Y226","v":0}]
[{"$f":"'DATOS DEPORTISTAS'!V227","v":"OS NABATERS D.F."},{"$f":"'DATOS DEPORTISTAS'!M227","v":"SARA BAILO GARCÍA"},{"$f":"'DATOS DEPORTISTAS'!X227","v":0},{"$f":"'DATOS DEPORTISTAS'!Y227","v":0}]
[{"$f":"'DATOS DEPORTISTAS'!V228","v":"OS NABATERS D.F."},{"$f":"'DATOS DEPORTISTAS'!M228","v":"JUAN ALEGRE TRIS"},{"$f":"'DATOS DEPORTISTAS'!X228","v":0},{"$f":"'DATOS DEPORTISTAS'!Y228","v":0}]
[{"$f":"'DATOS DEPORTISTAS'!V229","v":"OS NABATERS D.F."},{"$f":"'DATOS DEPORTISTAS'!M229","v":"JOSÉ LUIS MARTÍN ESCUÍN"},{"$f":"'DATOS DEPORTISTAS'!X229","v":0},{"$f":"'DATOS DEPORTISTAS'!Y229","v":0}]
[{"$f":"'DATOS DEPORTISTAS'!V230","v":"OS NABATERS D.F."},{"$f":"'DATOS DEPORTISTAS'!M230","v":"MARÍA ADELINA MARTISCA SUSANU"},{"$f":"'DATOS DEPORTISTAS'!X230","v":0},{"$f":"'DATOS DEPORTISTAS'!Y230","v":0}]
[{"$f":"'DATOS DEPORTISTAS'!V231","v":"OS NABATERS D.F."},{"$f":"'DATOS DEPORTISTAS'!M231","v":"LUIS FRANCISCO BOIRA GONZALO"},{"$f":"'DATOS DEPORTISTAS'!X231","v":0},{"$f":"'DATOS DEPORTISTAS'!Y231","v":0}]
[{"$f":"'DATOS DEPORTISTAS'!V232","v":"OS NABATERS D.F."},{"$f":"'DATOS DEPORTISTAS'!M232","v":"ÁNGEL DE MIGUEL BENITO"},{"$f":"'DATOS DEPORTISTAS'!X232","v":1},{"$f":"'DATOS DEPORTISTAS'!Y232","v":0}]
[{"$f":"'DATOS DEPORTISTAS'!V233","v":"OS NABATERS D.F."},{"$f":"'DATOS DEPORTISTAS'!M233","v":"ANA RUBIO EZPELETA"},{"$f":"'DATOS DEPORTISTAS'!X233","v":0},{"$f":"'DATOS DEPORTISTAS'!Y233","v":0}]
[{"$f":"'DATOS DEPORTISTAS'!V234","v":"OS NABATERS D.F."},{"$f":"'DATOS DEPORTISTAS'!M234","v":"EMANUEL ALEXANDRU-GEORGESCU"},{"$f":"'DATOS DEPORTISTAS'!X234","v":0},{"$f":"'DATOS DEPORTISTAS'!Y234","v":0}]
[{"$f":"'DATOS DEPORTISTAS'!V235","v":"OS NABATERS D.F."},{"$f":"'DATOS DEPORTISTAS'!M235","v":"YUSRA SORKHABI"},{"$f":"'DATOS DEPORTISTAS'!X235","v":0},{"$f":"'DATOS DEPORTISTAS'!Y235","v":0}]
[{"$f":"'DATOS DEPORTISTAS'!V236","v":"NAUTICO ZARAGOZA"},{"$f":"'DATOS DEPORTISTAS'!M236","v":"CLEMENTE FERNANDO LABORDA VAL"},{"$f":"'DATOS DEPORTISTAS'!X236","v":0},{"$f":"'DATOS DEPORTISTAS'!Y236","v":0}]
[{"$f":"'DATOS DEPORTISTAS'!V237","v":"NAUTICO ZARAGOZA"},{"$f":"'DATOS DEPORTISTAS'!M237","v":"IGNACIO JOSÉ RUIZ IRIBARNE"},{"$f":"'DATOS DEPORTISTAS'!X237","v":0},{"$f":"'DATOS DEPORTISTAS'!Y237","v":0}]
[{"$f":"'DATOS DEPORTISTAS'!V238","v":"NAUTICO ZARAGOZA"},{"$f":"'DATOS DEPORTISTAS'!M238","v":"JOSÉ MANUEL LARROY CALVO"},{"$f":"'DATOS DEPORTISTAS'!X238","v":0},{"$f":"'DATOS DEPORTISTAS'!Y238","v":1}]
[{"$f":"'DATOS DEPORTISTAS'!V239","v":"NAUTICO ZARAGOZA"},{"$f":"'DATOS DEPORTISTAS'!M239","v":"TEODORO TOBOSO MORENO"},{"$f":"'DATOS DEPORTISTAS'!X239","v":0},{"$f":"'DATOS DEPORTISTAS'!Y239","v":0}]
[{"$f":"'DATOS DEPORTISTAS'!V240","v":"CENTRO NATACION HELIOS"},{"$f":"'DATOS DEPORTISTAS'!M240","v":"ALBERTO VILLARAVIZ CHAVES"},{"$f":"'DATOS DEPORTISTAS'!X240","v":0},{"$f":"'DATOS DEPORTISTAS'!Y240","v":0}]
[{"$f":"'DATOS DEPORTISTAS'!V241","v":"OS NABATERS D.F."},{"$f":"'DATOS DEPORTISTAS'!M241","v":"JAIME PEÑA ROMERO DE TEJADA"},{"$f":"'DATOS DEPORTISTAS'!X241","v":0},{"$f":"'DATOS DEPORTISTAS'!Y241","v":0}]
[{"$f":"'DATOS DEPORTISTAS'!V242","v":"OS NABATERS D.F."},{"$f":"'DATOS DEPORTISTAS'!M242","v":"ITZIAR MARURI GARCÍA"},{"$f":"'DATOS DEPORTISTAS'!X242","v":0},{"$f":"'DATOS DEPORTISTAS'!Y242","v":0}]
[{"$f":"'DATOS DEPORTISTAS'!V243","v":"OS NABATERS D.F."},{"$f":"'DATOS DEPORTISTAS'!M243","v":"ÁNGEL BERNAL LECINA"},{"$f":"'DATOS DEPORTISTAS'!X243","v":1},{"$f":"'DATOS DEPORTISTAS'!Y243","v":0}]
[{"$f":"'DATOS DEPORTISTAS'!V244","v":"OS NABATERS D.F."},{"$f":"'DATOS DEPORTISTAS'!M244","v":"RAÚL GRACIA ANDIANO"},{"$f":"'DATOS DEPORTISTAS'!X244","v":0},{"$f":"'DATOS DEPORTISTAS'!Y244","v":0}]
[{"$f":"'DATOS DEPORTISTAS'!V245","v":"OS NABATERS D.F."},{"$f":"'DATOS DEPORTISTAS'!M245","v":"TOMÁS PELAYO BENEDET"},{"$f":"'DATOS DEPORTISTAS'!X245","v":0},{"$f":"'DATOS DEPORTISTAS'!Y245","v":0}]
[{"$f":"'DATOS DEPORTISTAS'!V246","v":"OS NABATERS D.F."},{"$f":"'DATOS DEPORTISTAS'!M246","v":"TATIANA CANO GALLEGO"},{"$f":"'DATOS DEPORTISTAS'!X246","v":0},{"$f":"'DATOS DEPORTISTAS'!Y246","v":0}]
[{"$f":"'DATOS DEPORTISTAS'!V247","v":"OS NABATERS D.F."},{"$f":"'DATOS DEPORTISTAS'!M247","v":"ANDREA HERNANDO FERRER"},{"$f":"'DATOS DEPORTISTAS'!X247","v":0},{"$f":"'DATOS DEPORTISTAS'!Y247","v":0}]
[{"$f":"'DATOS DEPORTISTAS'!V248","v":"OS NABATERS D.F."},{"$f":"'DATOS DEPORTISTAS'!M248","v":"JHONATHAN ESTYVEN DÍAZ TORNIÉ"},{"$f":"'DATOS DEPORTISTAS'!X248","v":0},{"$f":"'DATOS DEPORTISTAS'!Y248","v":0}]
[{"$f":"'DATOS DEPORTISTAS'!V249","v":"OS NABATERS D.F."},{"$f":"'DATOS DEPORTISTAS'!M249","v":"ALICIA PILAR ESTEVAN EIXARCH"},{"$f":"'DATOS DEPORTISTAS'!X249","v":0},{"$f":"'DATOS DEPORTISTAS'!Y249","v":0}]
[{"$f":"'DATOS DEPORTISTAS'!V250","v":"OS NABATERS D.F."},{"$f":"'DATOS DEPORTISTAS'!M250","v":"GABRIEL JOSÉ RUANO FERNÁNDEZ"},{"$f":"'DATOS DEPORTISTAS'!X250","v":0},{"$f":"'DATOS DEPORTISTAS'!Y250","v":0}]
[{"$f":"'DATOS DEPORTISTAS'!V251","v":"OS NABATERS D.F."},{"$f":"'DATOS DEPORTISTAS'!M251","v":"SANTIAGO LAVILLA TENÍAS"},{"$f":"'DATOS DEPORTISTAS'!X251","v":0},{"$f":"'DATOS DEPORTISTAS'!Y251","v":0}]
[{"$f":"'DATOS DEPORTISTAS'!V252","v":"OS NABATERS D.F."},{"$f":"'DATOS DEPORTISTAS'!M252","v":"ALICIA ROMERO DE LA ROSA"},{"$f":"'DATOS DEPORTISTAS'!X252","v":0},{"$f":"'DATOS DEPORTISTAS'!Y252","v":0}]
[{"$f":"'DATOS DEPORTISTAS'!V253","v":"OS NABATERS D.F."},{"$f":"'DATOS DEPORTISTAS'!M253","v":"CELIA PEÑA ROMERO DE TEJADA"},{"$f":"'DATOS DEPORTISTAS'!X253","v":0},{"$f":"'DATOS DEPORTISTAS'!Y253","v":0}]
[{"$f":"'DATOS DEPORTISTAS'!V254","v":"OS NABATERS D.F."},{"$f":"'DATOS DEPORTISTAS'!M254","v":"CARLOTA LAPLANA DÍAZ"},{"$f":"'DATOS DEPORTISTAS'!X254","v":0},{"$f":"'DATOS DEPORTISTAS'!Y254","v":0}]
[{"$f":"'DATOS DEPORTISTAS'!V255","v":"OS NABATERS D.F."},{"$f":"'DATOS DEPORTISTAS'!M255","v":"ALEJANDRO VILLACAMPA RÍOS"},{"$f":"'DATOS DEPORTISTAS'!X255","v":0},{"$f":"'DATOS DEPORTISTAS'!Y255","v":0}]
[{"$f":"'DATOS DEPORTISTAS'!V256","v":"OS NABATERS D.F."},{"$f":"'DATOS DEPORTISTAS'!M256","v":"JAVIER ROMEO GIL"},{"$f":"'DATOS DEPORTISTAS'!X256","v":0},{"$f":"'DATOS DEPORTISTAS'!Y256","v":0}]
[{"$f":"'DATOS DEPORTISTAS'!V257","v":"OS NABATERS D.F."},{"$f":"'DATOS DEPORTISTAS'!M257","v":"BORJA COSA REDONDO"},{"$f":"'DATOS DEPORTISTAS'!X257","v":0},{"$f":"'DATOS DEPORTISTAS'!Y257","v":0}]
[{"$f":"'DATOS DEPORTISTAS'!V258","v":"CAPRI MEQUINENZA"},{"$f":"'DATOS DEPORTISTAS'!M258","v":"ANTONIO MIGUEL VERA RUBERT"},{"$f":"'DATOS DEPORTISTAS'!X258","v":0},{"$f":"'DATOS DEPORTISTAS'!Y258","v":0}]
[{"$f":"'DATOS DEPORTISTAS'!V259","v":"OS NABATERS D.F."},{"$f":"'DATOS DEPORTISTAS'!M259","v":"PEDRO IGNACIO MARTÍNEZ CABELLO"},{"$f":"'DATOS DEPORTISTAS'!X259","v":0},{"$f":"'DATOS DEPORTISTAS'!Y259","v":1}]
[{"$f":"'DATOS DEPORTISTAS'!V260","v":"OS NABATERS D.F."},{"$f":"'DATOS DEPORTISTAS'!M260","v":"CLAUDIA ASO LÓPEZ"},{"$f":"'DATOS DEPORTISTAS'!X260","v":0},{"$f":"'DATOS DEPORTISTAS'!Y260","v":0}]
[{"$f":"'DATOS DEPORTISTAS'!V261","v":"OS NABATERS D.F."},{"$f":"'DATOS DEPORTISTAS'!M261","v":"LUIS ALBERTO IBARRA"},{"$f":"'DATOS DEPORTISTAS'!X261","v":0},{"$f":"'DATOS DEPORTISTAS'!Y261","v":0}]
[{"$f":"'DATOS DEPORTISTAS'!V262","v":"OS NABATERS D.F."},{"$f":"'DATOS DEPORTISTAS'!M262","v":"FRANCISCO HERNÁNDEZ RODRÍGUEZ"},{"$f":"'DATOS DEPORTISTAS'!X262","v":0},{"$f":"'DATOS DEPORTISTAS'!Y262","v":0}]
[{"$f":"'DATOS DEPORTISTAS'!V263","v":"CENTRO NATACION HELIOS"},{"$f":"'DATOS DEPORTISTAS'!M263","v":"MATILDE ESTRELLA RELANCIO PASTOR"},{"$f":"'DATOS DEPORTISTAS'!X263","v":0},{"$f":"'DATOS DEPORTISTAS'!Y263","v":0}]
[{"$f":"'DATOS DEPORTISTAS'!V264","v":"OS NABATERS D.F."},{"$f":"'DATOS DEPORTISTAS'!M264","v":"MARÍA AZUCENA FERNÁNDEZ RUIZ"},{"$f":"'DATOS DEPORTISTAS'!X264","v":0},{"$f":"'DATOS DEPORTISTAS'!Y264","v":0}]
[{"$f":"'DATOS DEPORTISTAS'!V265","v":"OS NABATERS D.F."},{"$f":"'DATOS DEPORTISTAS'!M265","v":"JOSÉ SALVADOR BARRERA RAMOS"},{"$f":"'DATOS DEPORTISTAS'!X265","v":0},{"$f":"'DATOS DEPORTISTAS'!Y265","v":0}]
[{"$f":"'DATOS DEPORTISTAS'!V266","v":"CAPRI MEQUINENZA"},{"$f":"'DATOS DEPORTISTAS'!M266","v":"KIARA VALVERDE ANDRÉS"},{"$f":"'DATOS DEPORTISTAS'!X266","v":0},{"$f":"'DATOS DEPORTISTAS'!Y266","v":0}]
[{"$f":"'DATOS DEPORTISTAS'!V267","v":"CENTRO NATACION HELIOS"},{"$f":"'DATOS DEPORTISTAS'!M267","v":"CARLOS MELGARES HIDALGO"},{"$f":"'DATOS DEPORTISTAS'!X267","v":0},{"$f":"'DATOS DEPORTISTAS'!Y267","v":0}]
[{"$f":"'DATOS DEPORTISTAS'!V268","v":"CENTRO NATACION HELIOS"},{"$f":"'DATOS DEPORTISTAS'!M268","v":"SERGIO LARROSA AZNAR"},{"$f":"'DATOS DEPORTISTAS'!X268","v":0},{"$f":"'DATOS DEPORTISTAS'!Y268","v":0}]
[{"$f":"'DATOS DEPORTISTAS'!V269","v":"CENTRO NATACION HELIOS"},{"$f":"'DATOS DEPORTISTAS'!M269","v":"JOAQUÍN JESÚS SORO FUENTES"},{"$f":"'DATOS DEPORTISTAS'!X269","v":0},{"$f":"'DATOS DEPORTISTAS'!Y269","v":0}]
[{"$f":"'DATOS DEPORTISTAS'!V270","v":"OS NABATERS D.F."},{"$f":"'DATOS DEPORTISTAS'!M270","v":"SERGIO AURED ANTÓN"},{"$f":"'DATOS DEPORTISTAS'!X270","v":0},{"$f":"'DATOS DEPORTISTAS'!Y270","v":0}]
[{"$f":"'DATOS DEPORTISTAS'!V271","v":"OS NABATERS D.F."},{"$f":"'DATOS DEPORTISTAS'!M271","v":"JUAN JOSÉ MUÑOZ LAHOZ"},{"$f":"'DATOS DEPORTISTAS'!X271","v":0},{"$f":"'DATOS DEPORTISTAS'!Y271","v":0}]
[{"$f":"'DATOS DEPORTISTAS'!V272","v":"OS NABATERS D.F."},{"$f":"'DATOS DEPORTISTAS'!M272","v":"JUAN MUÑOZ LÓPEZ"},{"$f":"'DATOS DEPORTISTAS'!X272","v":0},{"$f":"'DATOS DEPORTISTAS'!Y272","v":0}]
[{"$f":"'DATOS DEPORTISTAS'!V273","v":"OS NABATERS D.F."},{"$f":"'DATOS DEPORTISTAS'!M273","v":"PEDRO OLLOQUI LÁZARO"},{"$f":"'DATOS DEPORTISTAS'!X273","v":0},{"$f":"'DATOS DEPORTISTAS'!Y273","v":0}]
[{"$f":"'DATOS DEPORTISTAS'!V274","v":"CAPRI MEQUINENZA"},{"$f":"'DATOS DEPORTISTAS'!M274","v":"JOSEP REINADO VIRGILI"},{"$f":"'DATOS DEPORTISTAS'!X274","v":0},{"$f":"'DATOS DEPORTISTAS'!Y274","v":0}]
[{"$f":"'DATOS DEPORTISTAS'!V275","v":"CAPRI MEQUINENZA"},{"$f":"'DATOS DEPORTISTAS'!M275","v":"ALEJANDRO CANTERO ANDRÉS"},{"$f":"'DATOS DEPORTISTAS'!X275","v":0},{"$f":"'DATOS DEPORTISTAS'!Y275","v":0}]
[{"$f":"'DATOS DEPORTISTAS'!V276","v":"CAPRI MEQUINENZA"},{"$f":"'DATOS DEPORTISTAS'!M276","v":"ANDREW PI MOSOVSKA"},{"$f":"'DATOS DEPORTISTAS'!X276","v":0},{"$f":"'DATOS DEPORTISTAS'!Y276","v":0}]
[{"$f":"'DATOS DEPORTISTAS'!V277","v":"CAPRI MEQUINENZA"},{"$f":"'DATOS DEPORTISTAS'!M277","v":"ALICIA LLOP RUEDA"},{"$f":"'DATOS DEPORTISTAS'!X277","v":0},{"$f":"'DATOS DEPORTISTAS'!Y277","v":0}]
[{"$f":"'DATOS DEPORTISTAS'!V278","v":"CAPRI MEQUINENZA"},{"$f":"'DATOS DEPORTISTAS'!M278","v":"ERIC ROCA VENTURA"},{"$f":"'DATOS DEPORTISTAS'!X278","v":0},{"$f":"'DATOS DEPORTISTAS'!Y278","v":0}]
[{"$f":"'DATOS DEPORTISTAS'!V279","v":"CAPRI MEQUINENZA"},{"$f":"'DATOS DEPORTISTAS'!M279","v":"YUNE JUSTE IBARZ"},{"$f":"'DATOS DEPORTISTAS'!X279","v":0},{"$f":"'DATOS DEPORTISTAS'!Y279","v":0}]
[{"$f":"'DATOS DEPORTISTAS'!V280","v":"CAPRI MEQUINENZA"},{"$f":"'DATOS DEPORTISTAS'!M280","v":"EDUARDO ROMERA MURILLO"},{"$f":"'DATOS DEPORTISTAS'!X280","v":0},{"$f":"'DATOS DEPORTISTAS'!Y280","v":0}]
[{"$f":"'DATOS DEPORTISTAS'!V281","v":"CAPRI MEQUINENZA"},{"$f":"'DATOS DEPORTISTAS'!M281","v":"JUAN ANTONIO  CATALAN MULA"},{"$f":"'DATOS DEPORTISTAS'!X281","v":0},{"$f":"'DATOS DEPORTISTAS'!Y281","v":0}]
[{"$f":"'DATOS DEPORTISTAS'!V282","v":"CAPRI MEQUINENZA"},{"$f":"'DATOS DEPORTISTAS'!M282","v":"MERITXELL  LLOP CALLIZO"},{"$f":"'DATOS DEPORTISTAS'!X282","v":0},{"$f":"'DATOS DEPORTISTAS'!Y282","v":0}]
[{"$f":"'DATOS DEPORTISTAS'!V283","v":"CAPRI MEQUINENZA"},{"$f":"'DATOS DEPORTISTAS'!M283","v":"ORIOL  MIR IBARZ"},{"$f":"'DATOS DEPORTISTAS'!X283","v":0},{"$f":"'DATOS DEPORTISTAS'!Y283","v":0}]
[{"$f":"'DATOS DEPORTISTAS'!V284","v":"CAPRI MEQUINENZA"},{"$f":"'DATOS DEPORTISTAS'!M284","v":"DAVID TORO SOLER"},{"$f":"'DATOS DEPORTISTAS'!X284","v":0},{"$f":"'DATOS DEPORTISTAS'!Y284","v":0}]
[{"$f":"'DATOS DEPORTISTAS'!V285","v":"CAPRI MEQUINENZA"},{"$f":"'DATOS DEPORTISTAS'!M285","v":"JUDITH  GRAU BURRIEL"},{"$f":"'DATOS DEPORTISTAS'!X285","v":0},{"$f":"'DATOS DEPORTISTAS'!Y285","v":0}]
[{"$f":"'DATOS DEPORTISTAS'!V286","v":"CAPRI MEQUINENZA"},{"$f":"'DATOS DEPORTISTAS'!M286","v":"JOKIN KOLDO ESCALONA VILLACAMPA"},{"$f":"'DATOS DEPORTISTAS'!X286","v":0},{"$f":"'DATOS DEPORTISTAS'!Y286","v":0}]
[{"$f":"'DATOS DEPORTISTAS'!V287","v":"CAPRI MEQUINENZA"},{"$f":"'DATOS DEPORTISTAS'!M287","v":"RUBÉN  ALDABÓ LABAILA"},{"$f":"'DATOS DEPORTISTAS'!X287","v":0},{"$f":"'DATOS DEPORTISTAS'!Y287","v":0}]
[{"$f":"'DATOS DEPORTISTAS'!V288","v":"OS NABATERS"},{"$f":"'DATOS DEPORTISTAS'!M288","v":"ALICIA CABALLERO DE TORO"},{"$f":"'DATOS DEPORTISTAS'!X288","v":0},{"$f":"'DATOS DEPORTISTAS'!Y288","v":0}]
[{"$f":"'DATOS DEPORTISTAS'!V289","v":"OS NABATERS"},{"$f":"'DATOS DEPORTISTAS'!M289","v":"LEGA VICENTE MAGAÑA"},{"$f":"'DATOS DEPORTISTAS'!X289","v":0},{"$f":"'DATOS DEPORTISTAS'!Y289","v":0}]
[{"$f":"'DATOS DEPORTISTAS'!V290","v":"OS NABATERS"},{"$f":"'DATOS DEPORTISTAS'!M290","v":"ALBA LÓPEZ CORDOVILLA"},{"$f":"'DATOS DEPORTISTAS'!X290","v":0},{"$f":"'DATOS DEPORTISTAS'!Y290","v":0}]
[{"$f":"'DATOS DEPORTISTAS'!V291","v":"OS NABATERS"},{"$f":"'DATOS DEPORTISTAS'!M291","v":"JESÚS YUS DÍEZ"},{"$f":"'DATOS DEPORTISTAS'!X291","v":0},{"$f":"'DATOS DEPORTISTAS'!Y291","v":0}]
[{"$f":"'DATOS DEPORTISTAS'!V292","v":"CAPRI MEQUINENZA"},{"$f":"'DATOS DEPORTISTAS'!M292","v":"CARLOS SANJUAN SOLER"},{"$f":"'DATOS DEPORTISTAS'!X292","v":0},{"$f":"'DATOS DEPORTISTAS'!Y292","v":0}]
[{"$f":"'DATOS DEPORTISTAS'!V293","v":"CAPRI MEQUINENZA"},{"$f":"'DATOS DEPORTISTAS'!M293","v":"JOSÉ RAMÓN PALAU MARIMÓN"},{"$f":"'DATOS DEPORTISTAS'!X293","v":0},{"$f":"'DATOS DEPORTISTAS'!Y293","v":0}]
[{"$f":"'DATOS DEPORTISTAS'!V294","v":"OS NABATERS D.F."},{"$f":"'DATOS DEPORTISTAS'!M294","v":"ALEJANDRO DUCE CASCANTE"},{"$f":"'DATOS DEPORTISTAS'!X294","v":0},{"$f":"'DATOS DEPORTISTAS'!Y294","v":0}]
[{"$f":"'DATOS DEPORTISTAS'!V295","v":"OS NABATERS D.F."},{"$f":"'DATOS DEPORTISTAS'!M295","v":"LEO HIDALGO FERNÁNDEZ"},{"$f":"'DATOS DEPORTISTAS'!X295","v":0},{"$f":"'DATOS DEPORTISTAS'!Y295","v":0}]
[{"$f":"'DATOS DEPORTISTAS'!V296","v":"OS NABATERS D.F."},{"$f":"'DATOS DEPORTISTAS'!M296","v":"SIENA GIMENO BACHILLER"},{"$f":"'DATOS DEPORTISTAS'!X296","v":0},{"$f":"'DATOS DEPORTISTAS'!Y296","v":0}]
[{"$f":"'DATOS DEPORTISTAS'!V297","v":"OS NABATERS D.F."},{"$f":"'DATOS DEPORTISTAS'!M297","v":"JORGE OBENSA SIERRA"},{"$f":"'DATOS DEPORTISTAS'!X297","v":0},{"$f":"'DATOS DEPORTISTAS'!Y297","v":0}]
[{"$f":"'DATOS DEPORTISTAS'!V298","v":"OS NABATERS D.F."},{"$f":"'DATOS DEPORTISTAS'!M298","v":"RUBÉN SORIA GARCÍA"},{"$f":"'DATOS DEPORTISTAS'!X298","v":0},{"$f":"'DATOS DEPORTISTAS'!Y298","v":0}]
[{"$f":"'DATOS DEPORTISTAS'!V299","v":"OS NABATERS D.F."},{"$f":"'DATOS DEPORTISTAS'!M299","v":"RAQUEL DE MIGUEL GRACIA"},{"$f":"'DATOS DEPORTISTAS'!X299","v":0},{"$f":"'DATOS DEPORTISTAS'!Y299","v":0}]
[{"$f":"'DATOS DEPORTISTAS'!V300","v":0},{"$f":"'DATOS DEPORTISTAS'!M300","v":0},{"$f":"'DATOS DEPORTISTAS'!X300","v":0},{"$f":"'DATOS DEPORTISTAS'!Y300","v":0}]

{"sheet":"CENTRO NATACION HELIOS","index":9,"n_rows":492,"n_cols":34,"rows_kept":492,"cut":false,"hidden":true,"merged":[]}
[null,"CLUB","CAT.","NOMBRE COMPLETO"]
[null,{"$f":"'DATOS DEPORTISTAS'!V4","v":"F.A.R."},{"$f":"'DATOS DEPORTISTAS'!V4","v":"F.A.R."},{"$f":"'DATOS DEPORTISTAS'!M4","v":"PILAR ELVIRA ATIENZA"},null,null,"CLUB",null,"CATEGORIA"]
[null,{"$f":"'DATOS DEPORTISTAS'!V5","v":"F.A.R."},{"$f":"'DATOS DEPORTISTAS'!I5","v":"VETERANO"},{"$f":"'DATOS DEPORTISTAS'!M5","v":"MIGUEL GASCÓN GONZÁLEZ"},null,null,{"$f":"_xlfn._xlws.SORT(_xlfn.UNIQUE(Tabla12[CLUB]))","v":0},null,{"$f":"_xlfn._xlws.SORT(_xlfn.UNIQUE(Tabla12[CAT.]))","v":0}]
[null,{"$f":"'DATOS DEPORTISTAS'!V6","v":"F.A.R."},{"$f":"'DATOS DEPORTISTAS'!I6","v":"VETERANO"},{"$f":"'DATOS DEPORTISTAS'!M6","v":"JOSÉ JAVIER GONZÁLEZ-ARCE LABORDA"},null,null,"ARAGÓN REMO",null,"ALEVIN"]
[null,{"$f":"'DATOS DEPORTISTAS'!V7","v":"F.A.R."},{"$f":"'DATOS DEPORTISTAS'!I7","v":"VETERANO"},{"$f":"'DATOS DEPORTISTAS'!M7","v":"MARCOS GÓMEZ RODRÍGUEZ"},null,null,"C. DE REMO RETIRO 66",null,"BENJAMIN"]
[null,{"$f":"'DATOS DEPORTISTAS'!V8","v":"F.A.R."},{"$f":"'DATOS DEPORTISTAS'!I8","v":"VETERANO"},{"$f":"'DATOS DEPORTISTAS'!M8","v":"DANIEL CASORRÁN ROYO"},null,null,"CAPRI MEQUINENZA",null,"CADETE"]
[null,{"$f":"'DATOS DEPORTISTAS'!V9","v":"F.A.R."},{"$f":"'DATOS DEPORTISTAS'!I9","v":"VETERANO"},{"$f":"'DATOS DEPORTISTAS'!M9","v":"JOSÉ MIGUEL LLOP ROCA"},null,null,"CENTRO NATACION HELIOS",null,"F.A.R."]
[null,{"$f":"'DATOS DEPORTISTAS'!V10","v":"F.A.R."},{"$f":"'DATOS DEPORTISTAS'!I10","v":"VETERANO"},{"$f":"'DATOS DEPORTISTAS'!M10","v":"PEDRO JAVIER MORALES ALCUBIERRE"},null,null,"F.A.R.",null,"INFANTIL"]
[null,{"$f":"'DATOS DEPORTISTAS'!V11","v":"F.A.R."},{"$f":"'DATOS DEPORTISTAS'!I11","v":"VETERANO"},{"$f":"'DATOS DEPORTISTAS'!M11","v":"PEDRO IGNACIO MARTÍNEZ CABELLO"},null,null,"NAUTICO ZARAGOZA",null,"JUVENIL"]
[null,{"$f":"'DATOS DEPORTISTAS'!V12","v":"F.A.R."},{"$f":"'DATOS DEPORTISTAS'!I12","v":"VETERANO"},{"$f":"'DATOS DEPORTISTAS'!M12","v":"IGNACIO MARTÍNEZ BERMEJO"},null,null,"OS NABATERS",null,"SENIOR"]
[null,{"$f":"'DATOS DEPORTISTAS'!V13","v":"F.A.R."},{"$f":"'DATOS DEPORTISTAS'!I13","v":"VETERANO"},{"$f":"'DATOS DEPORTISTAS'!M13","v":"MARÍA JOSÉ GALLARDO BENÍTEZ"},null,null,"OS NABATERS D.F.",null,"VETERANO"]
[null,{"$f":"'DATOS DEPORTISTAS'!V14","v":"F.A.R."},{"$f":"'DATOS DEPORTISTAS'!I14","v":"VETERANO"},{"$f":"'DATOS DEPORTISTAS'!M14","v":"ÁNGEL AGUILERA ANDRÉS"}]
[null,{"$f":"'DATOS DEPORTISTAS'!V15","v":"F.A.R."},{"$f":"'DATOS DEPORTISTAS'!I15","v":"VETERANO"},{"$f":"'DATOS DEPORTISTAS'!M15","v":"BEATRIZ CASTELLÓ AYED"}]
[null,{"$f":"'DATOS DEPORTISTAS'!V16","v":"F.A.R."},{"$f":"'DATOS DEPORTISTAS'!I16","v":"VETERANO"},{"$f":"'DATOS DEPORTISTAS'!M16","v":"LLUIS ANTONI BARCELÓ LISO"},null,null,null,"CLUB","CATEGORIA",null,"CLUB","CATEGORIA",null,null,"CLUB","CATEGORIA",null,null,"CLUB","CATEGORIA",null,null,"CLUB","CATEGORIA",null,null,"CLUB","CATEGORIA",null,null,null,"CLUB","CATEGORIA"]
[null,{"$f":"'DATOS DEPORTISTAS'!V17","v":"F.A.R."},{"$f":"'DATOS DEPORTISTAS'!I17","v":"VETERANO"},{"$f":"'DATOS DEPORTISTAS'!M17","v":"BEATRIZ CUNCHILLOS PASCUAL"},null,null,null,"CENTRO NATACION HELIOS","VETERANO",null,"CENTRO NATACION HELIOS","SENIOR",null,null,"CENTRO NATACION HELIOS","JUVENIL",null,null,"CENTRO NATACION HELIOS","CADETE",null,null,"CENTRO NATACION HELIOS","INFANTIL",null,null,"CENTRO NATACION HELIOS","ALEVIN",null,null,null,"CENTRO NATACION HELIOS","BENJAMIN"]
[null,{"$f":"'DATOS DEPORTISTAS'!V18","v":"F.A.R."},{"$f":"'DATOS DEPORTISTAS'!I18","v":"BENJAMIN"},{"$f":"'DATOS DEPORTISTAS'!M18","v":" "}]
[null,{"$f":"'DATOS DEPORTISTAS'!V19","v":"F.A.R."},{"$f":"'DATOS DEPORTISTAS'!I19","v":"BENJAMIN"},{"$f":"'DATOS DEPORTISTAS'!M19","v":" "}]
[null,{"$f":"'DATOS DEPORTISTAS'!V20","v":"F.A.R."},{"$f":"'DATOS DEPORTISTAS'!I20","v":"BENJAMIN"},{"$f":"'DATOS DEPORTISTAS'!M20","v":" "},null,null,"CLUB","CAT.","NOMBRE COMPLETO",null,"CLUB","CAT.","NOMBRE COMPLETO",null,"CLUB","CAT.","NOMBRE COMPLETO",null,"CLUB","CAT.","NOMBRE COMPLETO",null,"CLUB","CAT.","NOMBRE COMPLETO",null,"CLUB","CAT.","NOMBRE COMPLETO",null,null,"CLUB","CAT.","NOMBRE COMPLETO"]
[null,{"$f":"'DATOS DEPORTISTAS'!V21","v":"F.A.R."},{"$f":"'DATOS DEPORTISTAS'!I21","v":"BENJAMIN"},{"$f":"'DATOS DEPORTISTAS'!M21","v":" "},null,null,{"$f":"_xlfn._xlws.SORT(_xlfn._xlws.FILTER(FILTRADO,(Tabla12[CLUB]=H15)*(Tabla12[CAT.]=I15)),3,1)","v":"CENTRO NATACION HELIOS"},"VETERANO","ADRIÁN CASAS GUILLÉN",null,{"$f":"_xlfn._xlws.SORT(_xlfn._xlws.FILTER(FILTRADO,(Tabla12[CLUB]=K15)*(Tabla12[CAT.]=L15)),3,1)","v":"CENTRO NATACION HELIOS"},"SENIOR","ALBERTO GARCÍA RUIZ",null,{"$f":"_xlfn._xlws.SORT(_xlfn._xlws.FILTER(FILTRADO,(Tabla12[CLUB]=O15)*(Tabla12[CAT.]=P15)),3,1)","v":"CENTRO NATACION HELIOS"},"JUVENIL","ALICIA YÁÑEZ MARTÍNEZ",null,{"$f":"_xlfn._xlws.SORT(_xlfn._xlws.FILTER(FILTRADO,(Tabla12[CLUB]=S15)*(Tabla12[CAT.]=T15)),3,1)","v":"CENTRO NATACION HELIOS"},"CADETE","ÁNGEL PERNIA OYAGA",null,{"$f":"_xlfn._xlws.SORT(_xlfn._xlws.FILTER(FILTRADO,(Tabla12[CLUB]=W15)*(Tabla12[CAT.]=X15)),3,1)","v":"CENTRO NATACION HELIOS"},"INFANTIL","ALICIA LUNA MONTAGUD",null,{"$f":"_xlfn._xlws.SORT(_xlfn._xlws.FILTER(FILTRADO,(Tabla12[CLUB]=AA15)*(Tabla12[CAT.]=AB15)),3,1)","v":"CENTRO NATACION HELIOS"},"ALEVIN","ADELA RELANCIO PASTOR",null,null,{"$f":"_xlfn._xlws.SORT(_xlfn._xlws.FILTER(FILTRADO,(Tabla12[CLUB]=AF15)*(Tabla12[CAT.]=AG15)),3,1)","v":"CENTRO NATACION HELIOS"},"BENJAMIN","ALMA RELANCIO PASTOR"]
[null,{"$f":"'DATOS DEPORTISTAS'!V22","v":"F.A.R."},{"$f":"'DATOS DEPORTISTAS'!I22","v":"BENJAMIN"},{"$f":"'DATOS DEPORTISTAS'!M22","v":" "},null,null,"CENTRO NATACION HELIOS","VETERANO","ALFONSO MUNIESA FERRERO",null,"CENTRO NATACION HELIOS","SENIOR","ALBERTO VILLARAVIZ CHAVES",null,"CENTRO NATACION HELIOS","JUVENIL","DIEGO JIMÉNEZ HORNOS",null,"CENTRO NATACION HELIOS","CADETE","CHLOÉ MILLÁN GÓMEZ",null,"CENTRO NATACION HELIOS","INFANTIL","ANTONIO IBÁÑEZ CUELLO",null,"CENTRO NATACION HELIOS","ALEVIN","JORGE LUNA MONTAGUD",null,null,"CENTRO NATACION HELIOS","BENJAMIN","ÁNGEL ROYO LAVILLA"]
[null,{"$f":"'DATOS DEPORTISTAS'!V23","v":"F.A.R."},{"$f":"'DATOS DEPORTISTAS'!I23","v":"BENJAMIN"},{"$f":"'DATOS DEPORTISTAS'!M23","v":" "},null,null,"CENTRO NATACION HELIOS","VETERANO","ALFREDO DIEZ SECO",null,"CENTRO NATACION HELIOS","SENIOR","ALEXANDER JURADO PÉREZ",null,"CENTRO NATACION HELIOS","JUVENIL","IKER ALONSO ROCHE",null,"CENTRO NATACION HELIOS","CADETE","DAVID SINUSIA LAVIL",null,"CENTRO NATACION HELIOS","INFANTIL","BRUNO LÁZARO QUÍLEZ",null,"CENTRO NATACION HELIOS","ALEVIN","LUCÍA MONTANER ALFARO",null,null,"CENTRO NATACION HELIOS","BENJAMIN","ÁNGELA RELANCIO PASTOR"]
[null,{"$f":"'DATOS DEPORTISTAS'!V24","v":"ARAGÓN REMO"},{"$f":"'DATOS DEPORTISTAS'!I24","v":"VETERANO"},{"$f":"'DATOS DEPORTISTAS'!M24","v":"FERNANDO CARLOS MILLÁN MAINAR"},null,null,"CENTRO NATACION HELIOS","VETERANO","ANDRÉS BLANCO VELÁZQUEZ",null,"CENTRO NATACION HELIOS","SENIOR","CYNTHIA MANOSALVAS PILLAJO",null,"CENTRO NATACION HELIOS","JUVENIL","IREK CABELLO PIETRZAK",null,"CENTRO NATACION HELIOS","CADETE","ERIC CAZADOR SERRANO",null,"CENTRO NATACION HELIOS","INFANTIL","GUILLERMO GUTIÉRREZ ANDOLZ",null,"CENTRO NATACION HELIOS","ALEVIN","MANUEL IBÁÑEZ CUELLO",null,null,"CENTRO NATACION HELIOS","BENJAMIN","JIMENA ESPADA CIPRÉS"]
[null,{"$f":"'DATOS DEPORTISTAS'!V25","v":"ARAGÓN REMO"},{"$f":"'DATOS DEPORTISTAS'!I25","v":"VETERANO"},{"$f":"'DATOS DEPORTISTAS'!M25","v":"SOFÍA EVA GÓMEZ GÓMEZ"},null,null,"CENTRO NATACION HELIOS","VETERANO","ANDRÉS DÍAZ ROBLES",null,"CENTRO NATACION HELIOS","SENIOR","FRANCISCO DE ASÍS LACRUZ SANZ",null,"CENTRO NATACION HELIOS","JUVENIL","ISABEL TOVAR GODOY",null,"CENTRO NATACION HELIOS","CADETE","FERNANDO MARTÍN RANERA",null,"CENTRO NATACION HELIOS","INFANTIL","IAGO IGLESIAS DELGADO",null,"CENTRO NATACION HELIOS","ALEVIN","VALENTINA ESPADA CIPRÉS",null,null,"CENTRO NATACION HELIOS","BENJAMIN","LUIS BUEY DE SACADURA"]
[null,{"$f":"'DATOS DEPORTISTAS'!V26","v":"ARAGÓN REMO"},{"$f":"'DATOS DEPORTISTAS'!I26","v":"VETERANO"},{"$f":"'DATOS DEPORTISTAS'!M26","v":"DAVID SAN JOSÉ SANTAMARÍA"},null,null,"CENTRO NATACION HELIOS","VETERANO","ANTONIO MIGUEL VILLORO GRASKE",null,"CENTRO NATACION HELIOS","SENIOR","ÍÑIGO MIGUEL ZAPATA LARROY",null,"CENTRO NATACION HELIOS","JUVENIL","JONÁS CALZADA LARA",null,"CENTRO NATACION HELIOS","CADETE","GERMÁN VILLORO ANGLÉS",null,"CENTRO NATACION HELIOS","INFANTIL","JOAQUÍN JESÚS SORO FUENTES",null,null,null,null,null,null,"CENTRO NATACION HELIOS","BENJAMIN","UDAY CAZADOR SERRANO"]
[null,{"$f":"'DATOS DEPORTISTAS'!V27","v":"CENTRO NATACION HELIOS"},{"$f":"'DATOS DEPORTISTAS'!I27","v":"SENIOR"},{"$f":"'DATOS DEPORTISTAS'!M27","v":"ALBERTO GARCÍA RUIZ"},null,null,"CENTRO NATACION HELIOS","VETERANO","CARLOS MELGARES HIDALGO",null,"CENTRO NATACION HELIOS","SENIOR","JAVIER MUNIESA AGUAS",null,"CENTRO NATACION HELIOS","JUVENIL","MANUEL GIRONÉS BENAVENTE",null,"CENTRO NATACION HELIOS","CADETE","IRENE ICHASO CEBADERO",null,"CENTRO NATACION HELIOS","INFANTIL","MARTÍN MILLÁN GÓMEZ",null,null,null,null,null,null,"CENTRO NATACION HELIOS","BENJAMIN","VÍCTOR LENNIKOV IGLESIAS"]
[null,{"$f":"'DATOS DEPORTISTAS'!V28","v":"CENTRO NATACION HELIOS"},{"$f":"'DATOS DEPORTISTAS'!I28","v":"VETERANO"},{"$f":"'DATOS DEPORTISTAS'!M28","v":"ALFONSO MUNIESA FERRERO"},null,null,"CENTRO NATACION HELIOS","VETERANO","DIEGO DE LAS CASAS JIMÉNEZ",null,"CENTRO NATACION HELIOS","SENIOR","JUAN LERMA IRURETA",null,"CENTRO NATACION HELIOS","JUVENIL","MARCO MELÉNDEZ DEL PICO",null,"CENTRO NATACION HELIOS","CADETE","JAVIER REMACHA PUSCO",null,"CENTRO NATACION HELIOS","INFANTIL","MATILDE ESTRELLA RELANCIO PASTOR"]
[null,{"$f":"'DATOS DEPORTISTAS'!V29","v":"CENTRO NATACION HELIOS"},{"$f":"'DATOS DEPORTISTAS'!I29","v":"CADETE"},{"$f":"'DATOS DEPORTISTAS'!M29","v":"ÁNGEL PERNIA OYAGA"},null,null,"CENTRO NATACION HELIOS","VETERANO","ELOY GARCÉS BALLERTE",null,"CENTRO NATACION HELIOS","SENIOR","KARLA REMACHA PUSCO",null,"CENTRO NATACION HELIOS","JUVENIL","MARGARET HONENSHLT",null,"CENTRO NATACION HELIOS","CADETE","JIMENA ALCÁNTARA BUATAS"]
[null,{"$f":"'DATOS DEPORTISTAS'!V30","v":"CENTRO NATACION HELIOS"},{"$f":"'DATOS DEPORTISTAS'!I30","v":"INFANTIL"},{"$f":"'DATOS DEPORTISTAS'!M30","v":"ANTONIO IBÁÑEZ CUELLO"},null,null,"CENTRO NATACION HELIOS","VETERANO","EMILIO ANASTASIO CILLEROS BLÁZQUEZ",null,"CENTRO NATACION HELIOS","SENIOR","MARÍA ROMEO VICENTE",null,"CENTRO NATACION HELIOS","JUVENIL","MARTÍN MONTANER ALFARO",null,"CENTRO NATACION HELIOS","CADETE","JOSÉ MANUEL FAÑA GRIÑÓN"]
[null,{"$f":"'DATOS DEPORTISTAS'!V31","v":"CENTRO NATACION HELIOS"},{"$f":"'DATOS DEPORTISTAS'!I31","v":"ALEVIN"},{"$f":"'DATOS DEPORTISTAS'!M31","v":"MANUEL IBÁÑEZ CUELLO"},null,null,"CENTRO NATACION HELIOS","VETERANO","ESMERALDA AGUAS GARCIA",null,"CENTRO NATACION HELIOS","SENIOR","PABLO BRIZ ZAMORANO",null,"CENTRO NATACION HELIOS","JUVENIL","NIL MARTÍN BERNARDOS",null,"CENTRO NATACION HELIOS","CADETE","JUAN TOVAR GODOY"]
[null,{"$f":"'DATOS DEPORTISTAS'!V32","v":"CENTRO NATACION HELIOS"},{"$f":"'DATOS DEPORTISTAS'!I32","v":"CADETE"},{"$f":"'DATOS DEPORTISTAS'!M32","v":"IRENE ICHASO CEBADERO"},null,null,"CENTRO NATACION HELIOS","VETERANO","EVA MARÍA ANGLÉS BEL",null,"CENTRO NATACION HELIOS","SENIOR","PEDRO DIEZ GARCÍA",null,"CENTRO NATACION HELIOS","JUVENIL","NOA FUERTES VALLÉS",null,"CENTRO NATACION HELIOS","CADETE","PABLO GASCÓN RAHONA"]
[null,{"$f":"'DATOS DEPORTISTAS'!V33","v":"CENTRO NATACION HELIOS"},{"$f":"'DATOS DEPORTISTAS'!I33","v":"JUVENIL"},{"$f":"'DATOS DEPORTISTAS'!M33","v":"JONÁS CALZADA LARA"},null,null,"CENTRO NATACION HELIOS","VETERANO","GREGORIO PRADAS QUERO",null,"CENTRO NATACION HELIOS","SENIOR","PILAR MARCÉN GUTIÉRREZ",null,"CENTRO NATACION HELIOS","JUVENIL","PABLO MALO VELA",null,"CENTRO NATACION HELIOS","CADETE","SOFÍA MONTANER ALFARO"]
[null,{"$f":"'DATOS DEPORTISTAS'!V34","v":"CENTRO NATACION HELIOS"},{"$f":"'DATOS DEPORTISTAS'!I34","v":"VETERANO"},{"$f":"'DATOS DEPORTISTAS'!M34","v":"MARTA PINTO SOLANA"},null,null,"CENTRO NATACION HELIOS","VETERANO","IVÁN LATAS JIMÉNEZ",null,"CENTRO NATACION HELIOS","SENIOR","TRISTÁN GASCÓN MARCHAL",null,"CENTRO NATACION HELIOS","JUVENIL","SANDRA DIEZ GARCÍA",null,"CENTRO NATACION HELIOS","CADETE","VÍCTOR CINCA GARCÍA"]
[null,{"$f":"'DATOS DEPORTISTAS'!V35","v":"CENTRO NATACION HELIOS"},{"$f":"'DATOS DEPORTISTAS'!I35","v":"CADETE"},{"$f":"'DATOS DEPORTISTAS'!M35","v":"PABLO GASCÓN RAHONA"},null,null,"CENTRO NATACION HELIOS","VETERANO","IVÁN PÉREZ RODRÍGUEZ"]
[null,{"$f":"'DATOS DEPORTISTAS'!V36","v":"CENTRO NATACION HELIOS"},{"$f":"'DATOS DEPORTISTAS'!I36","v":"VETERANO"},{"$f":"'DATOS DEPORTISTAS'!M36","v":"TERESA GUTIÉRREZ GIMÉNEZ"},null,null,"CENTRO NATACION HELIOS","VETERANO","JAVIER BARRACHINA RODRÍGUEZ"]
[null,{"$f":"'DATOS DEPORTISTAS'!V37","v":"CAPRI MEQUINENZA"},{"$f":"'DATOS DEPORTISTAS'!I37","v":"INFANTIL"},{"$f":"'DATOS DEPORTISTAS'!M37","v":"ABRIL GONZÁLEZ GARCÍA"},null,null,"CENTRO NATACION HELIOS","VETERANO","JORGE OCTAVIO CALVO GRACIA"]
[null,{"$f":"'DATOS DEPORTISTAS'!V38","v":"CAPRI MEQUINENZA"},{"$f":"'DATOS DEPORTISTAS'!I38","v":"INFANTIL"},{"$f":"'DATOS DEPORTISTAS'!M38","v":"ALBA CUCHÍ NIUBÓ"},null,null,"CENTRO NATACION HELIOS","VETERANO","JORGE PEIRÓ MESA"]
[null,{"$f":"'DATOS DEPORTISTAS'!V39","v":"CAPRI MEQUINENZA"},{"$f":"'DATOS DEPORTISTAS'!I39","v":"ALEVIN"},{"$f":"'DATOS DEPORTISTAS'!M39","v":"ALBA MARTÍNEZ CLAVERO"},null,null,"CENTRO NATACION HELIOS","VETERANO","JOSÉ GABRIEL SEBASTIÁN BELANCHE"]
[null,{"$f":"'DATOS DEPORTISTAS'!V40","v":"CAPRI MEQUINENZA"},{"$f":"'DATOS DEPORTISTAS'!I40","v":"ALEVIN"},{"$f":"'DATOS DEPORTISTAS'!M40","v":"ALEX CATALÁN MOYA"},null,null,"CENTRO NATACION HELIOS","VETERANO","JOSÉ LACASTA AISA"]
[null,{"$f":"'DATOS DEPORTISTAS'!V41","v":"CAPRI MEQUINENZA"},{"$f":"'DATOS DEPORTISTAS'!I41","v":"CADETE"},{"$f":"'DATOS DEPORTISTAS'!M41","v":"ÁLEX VILELLA BERENGUER"},null,null,"CENTRO NATACION HELIOS","VETERANO","JOSÉ MANUEL BIELSA ARTIDIELLO"]
[null,{"$f":"'DATOS DEPORTISTAS'!V42","v":"CAPRI MEQUINENZA"},{"$f":"'DATOS DEPORTISTAS'!I42","v":"VETERANO"},{"$f":"'DATOS DEPORTISTAS'!M42","v":"ALFONSO PÉREZ ALONSO"},null,null,"CENTRO NATACION HELIOS","VETERANO","JOSÉ TABUENCA COLERA"]
[null,{"$f":"'DATOS DEPORTISTAS'!V43","v":"CAPRI MEQUINENZA"},{"$f":"'DATOS DEPORTISTAS'!I43","v":"INFANTIL"},{"$f":"'DATOS DEPORTISTAS'!M43","v":"AROA CASTELLÓ VILA"},null,null,"CENTRO NATACION HELIOS","VETERANO","JUAN CARLOS CALAVIA RODRÍGUEZ"]
[null,{"$f":"'DATOS DEPORTISTAS'!V44","v":"CAPRI MEQUINENZA"},{"$f":"'DATOS DEPORTISTAS'!I44","v":"BENJAMIN"},{"$f":"'DATOS DEPORTISTAS'!M44","v":"CARMEN RODES ESTRUGA"},null,null,"CENTRO NATACION HELIOS","VETERANO","JUAN JOSÉ SALAS IBÁÑEZ"]
[null,{"$f":"'DATOS DEPORTISTAS'!V45","v":"CAPRI MEQUINENZA"},{"$f":"'DATOS DEPORTISTAS'!I45","v":"VETERANO"},{"$f":"'DATOS DEPORTISTAS'!M45","v":"CONCEPCIÓN CASTRO ARANDA"},null,null,"CENTRO NATACION HELIOS","VETERANO","JULIO BIELSA ARTIDIELLO"]
[null,{"$f":"'DATOS DEPORTISTAS'!V46","v":"CAPRI MEQUINENZA"},{"$f":"'DATOS DEPORTISTAS'!I46","v":"VETERANO"},{"$f":"'DATOS DEPORTISTAS'!M46","v":"DANIEL CUCHÍ SAGARRA"},null,null,"CENTRO NATACION HELIOS","VETERANO","MARIA ÁNGELES PASTOR MONTAÑO"]
[null,{"$f":"'DATOS DEPORTISTAS'!V47","v":"CAPRI MEQUINENZA"},{"$f":"'DATOS DEPORTISTAS'!I47","v":"VETERANO"},{"$f":"'DATOS DEPORTISTAS'!M47","v":"DAVID OLIVER CABALLÉ"},null,null,"CENTRO NATACION HELIOS","VETERANO","MARÍA PILAR PEÑA HERRERO"]
[null,{"$f":"'DATOS DEPORTISTAS'!V48","v":"CAPRI MEQUINENZA"},{"$f":"'DATOS DEPORTISTAS'!I48","v":"CADETE"},{"$f":"'DATOS DEPORTISTAS'!M48","v":"DIEGO AGUILAR ROMERO"},null,null,"CENTRO NATACION HELIOS","VETERANO","MARTA PINTO SOLANA"]
[null,{"$f":"'DATOS DEPORTISTAS'!V49","v":"CAPRI MEQUINENZA"},{"$f":"'DATOS DEPORTISTAS'!I49","v":"SENIOR"},{"$f":"'DATOS DEPORTISTAS'!M49","v":"ELENA STEGHERR LLOP"},null,null,"CENTRO NATACION HELIOS","VETERANO","MIGUEL ÁNGEL PÉREZ VICENTE"]
[null,{"$f":"'DATOS DEPORTISTAS'!V50","v":"CAPRI MEQUINENZA"},{"$f":"'DATOS DEPORTISTAS'!I50","v":"BENJAMIN"},{"$f":"'DATOS DEPORTISTAS'!M50","v":"ENZO EXPÓSITO SORO"},null,null,"CENTRO NATACION HELIOS","VETERANO","PEDRO BENITO ARANDA MARTÍNEZ"]
[null,{"$f":"'DATOS DEPORTISTAS'!V51","v":"CAPRI MEQUINENZA"},{"$f":"'DATOS DEPORTISTAS'!I51","v":"VETERANO"},{"$f":"'DATOS DEPORTISTAS'!M51","v":"ESTHER ANDRÉS CARRILLO"},null,null,"CENTRO NATACION HELIOS","VETERANO","PEDRO MARÍA NAVARRO SANGüESA"]
[null,{"$f":"'DATOS DEPORTISTAS'!V52","v":"CAPRI MEQUINENZA"},{"$f":"'DATOS DEPORTISTAS'!I52","v":"JUVENIL"},{"$f":"'DATOS DEPORTISTAS'!M52","v":"GISELA HIERRO GARCÍA"},null,null,"CENTRO NATACION HELIOS","VETERANO","RAFAEL MONTANER MARTÍN"]
[null,{"$f":"'DATOS DEPORTISTAS'!V53","v":"CAPRI MEQUINENZA"},{"$f":"'DATOS DEPORTISTAS'!I53","v":"BENJAMIN"},{"$f":"'DATOS DEPORTISTAS'!M53","v":"IBAI BLAS PEÑALVER"},null,null,"CENTRO NATACION HELIOS","VETERANO","RUTH SÁEZ LARREA"]
[null,{"$f":"'DATOS DEPORTISTAS'!V54","v":"CAPRI MEQUINENZA"},{"$f":"'DATOS DEPORTISTAS'!I54","v":"ALEVIN"},{"$f":"'DATOS DEPORTISTAS'!M54","v":"IKER SANJUÁN SATORRES"},null,null,"CENTRO NATACION HELIOS","VETERANO","SERGIO LARROSA AZNAR"]
[null,{"$f":"'DATOS DEPORTISTAS'!V55","v":"CAPRI MEQUINENZA"},{"$f":"'DATOS DEPORTISTAS'!I55","v":"CADETE"},{"$f":"'DATOS DEPORTISTAS'!M55","v":"IRATXE IBARZ BERENGUER"},null,null,"CENTRO NATACION HELIOS","VETERANO","SYLVIA MARÍA MELO HURTADO"]
[null,{"$f":"'DATOS DEPORTISTAS'!V56","v":"CAPRI MEQUINENZA"},{"$f":"'DATOS DEPORTISTAS'!I56","v":"CADETE"},{"$f":"'DATOS DEPORTISTAS'!M56","v":"IRENE BRUNA PALAU"},null,null,"CENTRO NATACION HELIOS","VETERANO","TERESA GUTIÉRREZ GIMÉNEZ"]
[null,{"$f":"'DATOS DEPORTISTAS'!V57","v":"CAPRI MEQUINENZA"},{"$f":"'DATOS DEPORTISTAS'!I57","v":"CADETE"},{"$f":"'DATOS DEPORTISTAS'!M57","v":"IRIA EXPÓSITO SORO"},null,null,"CENTRO NATACION HELIOS","VETERANO","VÍCTOR ESTEBAN GRAN"]
[null,{"$f":"'DATOS DEPORTISTAS'!V58","v":"CAPRI MEQUINENZA"},{"$f":"'DATOS DEPORTISTAS'!I58","v":"CADETE"},{"$f":"'DATOS DEPORTISTAS'!M58","v":"ISMAEL RAHIBI VIDALLET"}]
[null,{"$f":"'DATOS DEPORTISTAS'!V59","v":"CAPRI MEQUINENZA"},{"$f":"'DATOS DEPORTISTAS'!I59","v":"INFANTIL"},{"$f":"'DATOS DEPORTISTAS'!M59","v":"IVÁN CASTELLNOU SOROLLA"}]
[null,{"$f":"'DATOS DEPORTISTAS'!V60","v":"CAPRI MEQUINENZA"},{"$f":"'DATOS DEPORTISTAS'!I60","v":"BENJAMIN"},{"$f":"'DATOS DEPORTISTAS'!M60","v":"IVÁN EXPÓSITO VARGAS"}]
[null,{"$f":"'DATOS DEPORTISTAS'!V61","v":"CAPRI MEQUINENZA"},{"$f":"'DATOS DEPORTISTAS'!I61","v":"ALEVIN"},{"$f":"'DATOS DEPORTISTAS'!M61","v":"JOEL CHERTÓ JIMÉNEZ"}]
[null,{"$f":"'DATOS DEPORTISTAS'!V62","v":"CAPRI MEQUINENZA"},{"$f":"'DATOS DEPORTISTAS'!I62","v":"VETERANO"},{"$f":"'DATOS DEPORTISTAS'!M62","v":"JORDI CASTELLÓ ROCA"}]
[null,{"$f":"'DATOS DEPORTISTAS'!V63","v":"CAPRI MEQUINENZA"},{"$f":"'DATOS DEPORTISTAS'!I63","v":"VETERANO"},{"$f":"'DATOS DEPORTISTAS'!M63","v":"JORGE MANUEL AGUILAR OLIVER"}]
[null,{"$f":"'DATOS DEPORTISTAS'!V64","v":"CAPRI MEQUINENZA"},{"$f":"'DATOS DEPORTISTAS'!I64","v":"SENIOR"},{"$f":"'DATOS DEPORTISTAS'!M64","v":"JULIA RAMI CASTRO"}]
[null,{"$f":"'DATOS DEPORTISTAS'!V65","v":"CAPRI MEQUINENZA"},{"$f":"'DATOS DEPORTISTAS'!I65","v":"VETERANO"},{"$f":"'DATOS DEPORTISTAS'!M65","v":"LORENA NOGUÉS NICOLÁS"}]
[null,{"$f":"'DATOS DEPORTISTAS'!V66","v":"CAPRI MEQUINENZA"},{"$f":"'DATOS DEPORTISTAS'!I66","v":"VETERANO"},{"$f":"'DATOS DEPORTISTAS'!M66","v":"LUIS ESTEVE CATALÁN"}]
[null,{"$f":"'DATOS DEPORTISTAS'!V67","v":"CAPRI MEQUINENZA"},{"$f":"'DATOS DEPORTISTAS'!I67","v":"VETERANO"},{"$f":"'DATOS DEPORTISTAS'!M67","v":"Mª CARMEN GARCÍA ARANDA"}]
[null,{"$f":"'DATOS DEPORTISTAS'!V68","v":"CAPRI MEQUINENZA"},{"$f":"'DATOS DEPORTISTAS'!I68","v":"VETERANO"},{"$f":"'DATOS DEPORTISTAS'!M68","v":"MARÍA TERESA GODIA PI"}]
[null,{"$f":"'DATOS DEPORTISTAS'!V69","v":"CAPRI MEQUINENZA"},{"$f":"'DATOS DEPORTISTAS'!I69","v":"BENJAMIN"},{"$f":"'DATOS DEPORTISTAS'!M69","v":"MARC CASTELLO VILA"}]
[null,{"$f":"'DATOS DEPORTISTAS'!V70","v":"CAPRI MEQUINENZA"},{"$f":"'DATOS DEPORTISTAS'!I70","v":"BENJAMIN"},{"$f":"'DATOS DEPORTISTAS'!M70","v":"MARÍA AGUILAR ROMERO"}]
[null,{"$f":"'DATOS DEPORTISTAS'!V71","v":"CAPRI MEQUINENZA"},{"$f":"'DATOS DEPORTISTAS'!I71","v":"INFANTIL"},{"$f":"'DATOS DEPORTISTAS'!M71","v":"MARÍA ARROYO CABALLÉ"}]
[null,{"$f":"'DATOS DEPORTISTAS'!V72","v":"CAPRI MEQUINENZA"},{"$f":"'DATOS DEPORTISTAS'!I72","v":"CADETE"},{"$f":"'DATOS DEPORTISTAS'!M72","v":"MARINA CATALÁN MOYA"}]
[null,{"$f":"'DATOS DEPORTISTAS'!V73","v":"CAPRI MEQUINENZA"},{"$f":"'DATOS DEPORTISTAS'!I73","v":"VETERANO"},{"$f":"'DATOS DEPORTISTAS'!M73","v":"MARISOL CLAVERO GARCÍA"}]
[null,{"$f":"'DATOS DEPORTISTAS'!V74","v":"CAPRI MEQUINENZA"},{"$f":"'DATOS DEPORTISTAS'!I74","v":"BENJAMIN"},{"$f":"'DATOS DEPORTISTAS'!M74","v":"MAX GUARDIOLA LOPERA"}]
[null,{"$f":"'DATOS DEPORTISTAS'!V75","v":"CAPRI MEQUINENZA"},{"$f":"'DATOS DEPORTISTAS'!I75","v":"SENIOR"},{"$f":"'DATOS DEPORTISTAS'!M75","v":"MIGUEL RUBIO LAMBEA"}]
[null,{"$f":"'DATOS DEPORTISTAS'!V76","v":"CAPRI MEQUINENZA"},{"$f":"'DATOS DEPORTISTAS'!I76","v":"CADETE"},{"$f":"'DATOS DEPORTISTAS'!M76","v":"MIRIAM BRUNA PALAU"}]
[null,{"$f":"'DATOS DEPORTISTAS'!V77","v":"CAPRI MEQUINENZA"},{"$f":"'DATOS DEPORTISTAS'!I77","v":"JUVENIL"},{"$f":"'DATOS DEPORTISTAS'!M77","v":"MOHAMED ADAM RAHIBI VIDALLET"}]
[null,{"$f":"'DATOS DEPORTISTAS'!V78","v":"CAPRI MEQUINENZA"},{"$f":"'DATOS DEPORTISTAS'!I78","v":"ALEVIN"},{"$f":"'DATOS DEPORTISTAS'!M78","v":"ONA ESTRUGA LLOP"}]
[null,{"$f":"'DATOS DEPORTISTAS'!V79","v":"CAPRI MEQUINENZA"},{"$f":"'DATOS DEPORTISTAS'!I79","v":"VETERANO"},{"$f":"'DATOS DEPORTISTAS'!M79","v":"PATRYCJA JANIK"}]
[null,{"$f":"'DATOS DEPORTISTAS'!V80","v":"CAPRI MEQUINENZA"},{"$f":"'DATOS DEPORTISTAS'!I80","v":"BENJAMIN"},{"$f":"'DATOS DEPORTISTAS'!M80","v":"PAULA CUCHÍ NIUBÓ"}]
[null,{"$f":"'DATOS DEPORTISTAS'!V81","v":"CAPRI MEQUINENZA"},{"$f":"'DATOS DEPORTISTAS'!I81","v":"CADETE"},{"$f":"'DATOS DEPORTISTAS'!M81","v":"PAULO GUIMERÁ JANIK"}]
[null,{"$f":"'DATOS DEPORTISTAS'!V82","v":"CAPRI MEQUINENZA"},{"$f":"'DATOS DEPORTISTAS'!I82","v":"VETERANO"},{"$f":"'DATOS DEPORTISTAS'!M82","v":"RAQUEL CABALLÉ SILVESTRE"}]
[null,{"$f":"'DATOS DEPORTISTAS'!V83","v":"CAPRI MEQUINENZA"},{"$f":"'DATOS DEPORTISTAS'!I83","v":"VETERANO"},{"$f":"'DATOS DEPORTISTAS'!M83","v":"ROSANA NIUBÓ SOROLLA"}]
[null,{"$f":"'DATOS DEPORTISTAS'!V84","v":"CAPRI MEQUINENZA"},{"$f":"'DATOS DEPORTISTAS'!I84","v":"VETERANO"},{"$f":"'DATOS DEPORTISTAS'!M84","v":"SARA  ROMERO OLMOS"}]
[null,{"$f":"'DATOS DEPORTISTAS'!V85","v":"CAPRI MEQUINENZA"},{"$f":"'DATOS DEPORTISTAS'!I85","v":"ALEVIN"},{"$f":"'DATOS DEPORTISTAS'!M85","v":"SAÚL VIU NOGUÉS"}]
[null,{"$f":"'DATOS DEPORTISTAS'!V86","v":"CAPRI MEQUINENZA"},{"$f":"'DATOS DEPORTISTAS'!I86","v":"VETERANO"},{"$f":"'DATOS DEPORTISTAS'!M86","v":"VÍCTOR ESTRUGA GIMENO"}]
[null,{"$f":"'DATOS DEPORTISTAS'!V87","v":"CAPRI MEQUINENZA"},{"$f":"'DATOS DEPORTISTAS'!I87","v":"VETERANO"},{"$f":"'DATOS DEPORTISTAS'!M87","v":"VICTORIA SANTAELLA MAIRELES"}]
[null,{"$f":"'DATOS DEPORTISTAS'!V88","v":"CAPRI MEQUINENZA"},{"$f":"'DATOS DEPORTISTAS'!I88","v":"CADETE"},{"$f":"'DATOS DEPORTISTAS'!M88","v":"YERAY MARTÍNEZ CLAVERO"}]
[null,{"$f":"'DATOS DEPORTISTAS'!V89","v":"CENTRO NATACION HELIOS"},{"$f":"'DATOS DEPORTISTAS'!I89","v":"SENIOR"},{"$f":"'DATOS DEPORTISTAS'!M89","v":"CYNTHIA MANOSALVAS PILLAJO"}]
[null,{"$f":"'DATOS DEPORTISTAS'!V90","v":"ARAGÓN REMO"},{"$f":"'DATOS DEPORTISTAS'!I90","v":"VETERANO"},{"$f":"'DATOS DEPORTISTAS'!M90","v":"CARLOS MILLÁN BLASCO"}]
[null,{"$f":"'DATOS DEPORTISTAS'!V91","v":"ARAGÓN REMO"},{"$f":"'DATOS DEPORTISTAS'!I91","v":"VETERANO"},{"$f":"'DATOS DEPORTISTAS'!M91","v":"JOSÉ MANUEL LABARTA PINILLA"}]
[null,{"$f":"'DATOS DEPORTISTAS'!V92","v":"CENTRO NATACION HELIOS"},{"$f":"'DATOS DEPORTISTAS'!I92","v":"VETERANO"},{"$f":"'DATOS DEPORTISTAS'!M92","v":"ESMERALDA AGUAS GARCIA"}]
[null,{"$f":"'DATOS DEPORTISTAS'!V93","v":"CENTRO NATACION HELIOS"},{"$f":"'DATOS DEPORTISTAS'!I93","v":"JUVENIL"},{"$f":"'DATOS DEPORTISTAS'!M93","v":"IKER ALONSO ROCHE"}]
[null,{"$f":"'DATOS DEPORTISTAS'!V94","v":"CENTRO NATACION HELIOS"},{"$f":"'DATOS DEPORTISTAS'!I94","v":"VETERANO"},{"$f":"'DATOS DEPORTISTAS'!M94","v":"EVA MARÍA ANGLÉS BEL"}]
[null,{"$f":"'DATOS DEPORTISTAS'!V95","v":"CENTRO NATACION HELIOS"},{"$f":"'DATOS DEPORTISTAS'!I95","v":"VETERANO"},{"$f":"'DATOS DEPORTISTAS'!M95","v":"JAVIER BARRACHINA RODRÍGUEZ"}]
[null,{"$f":"'DATOS DEPORTISTAS'!V96","v":"CENTRO NATACION HELIOS"},{"$f":"'DATOS DEPORTISTAS'!I96","v":"VETERANO"},{"$f":"'DATOS DEPORTISTAS'!M96","v":"JULIO BIELSA ARTIDIELLO"}]
[null,{"$f":"'DATOS DEPORTISTAS'!V97","v":"CENTRO NATACION HELIOS"},{"$f":"'DATOS DEPORTISTAS'!I97","v":"VETERANO"},{"$f":"'DATOS DEPORTISTAS'!M97","v":"ANDRÉS BLANCO VELÁZQUEZ"}]
[null,{"$f":"'DATOS DEPORTISTAS'!V98","v":"CENTRO NATACION HELIOS"},{"$f":"'DATOS DEPORTISTAS'!I98","v":"SENIOR"},{"$f":"'DATOS DEPORTISTAS'!M98","v":"PABLO BRIZ ZAMORANO"}]
[null,{"$f":"'DATOS DEPORTISTAS'!V99","v":"CENTRO NATACION HELIOS"},{"$f":"'DATOS DEPORTISTAS'!I99","v":"BENJAMIN"},{"$f":"'DATOS DEPORTISTAS'!M99","v":"LUIS BUEY DE SACADURA"}]
[null,{"$f":"'DATOS DEPORTISTAS'!V100","v":"CENTRO NATACION HELIOS"},{"$f":"'DATOS DEPORTISTAS'!I100","v":"JUVENIL"},{"$f":"'DATOS DEPORTISTAS'!M100","v":"IREK CABELLO PIETRZAK"}]
[null,{"$f":"'DATOS DEPORTISTAS'!V101","v":"CENTRO NATACION HELIOS"},{"$f":"'DATOS DEPORTISTAS'!I101","v":"VETERANO"},{"$f":"'DATOS DEPORTISTAS'!M101","v":"JUAN CARLOS CALAVIA RODRÍGUEZ"}]
[null,{"$f":"'DATOS DEPORTISTAS'!V102","v":"CENTRO NATACION HELIOS"},{"$f":"'DATOS DEPORTISTAS'!I102","v":"VETERANO"},{"$f":"'DATOS DEPORTISTAS'!M102","v":"JORGE OCTAVIO CALVO GRACIA"}]
[null,{"$f":"'DATOS DEPORTISTAS'!V103","v":"CENTRO NATACION HELIOS"},{"$f":"'DATOS DEPORTISTAS'!I103","v":"VETERANO"},{"$f":"'DATOS DEPORTISTAS'!M103","v":"ADRIÁN CASAS GUILLÉN"}]
[null,{"$f":"'DATOS DEPORTISTAS'!V104","v":"CENTRO NATACION HELIOS"},{"$f":"'DATOS DEPORTISTAS'!I104","v":"CADETE"},{"$f":"'DATOS DEPORTISTAS'!M104","v":"ERIC CAZADOR SERRANO"}]
[null,{"$f":"'DATOS DEPORTISTAS'!V105","v":"CENTRO NATACION HELIOS"},{"$f":"'DATOS DEPORTISTAS'!I105","v":"BENJAMIN"},{"$f":"'DATOS DEPORTISTAS'!M105","v":"UDAY CAZADOR SERRANO"}]
[null,{"$f":"'DATOS DEPORTISTAS'!V106","v":"CENTRO NATACION HELIOS"},{"$f":"'DATOS DEPORTISTAS'!I106","v":"VETERANO"},{"$f":"'DATOS DEPORTISTAS'!M106","v":"EMILIO ANASTASIO CILLEROS BLÁZQUEZ"}]
[null,{"$f":"'DATOS DEPORTISTAS'!V107","v":"CENTRO NATACION HELIOS"},{"$f":"'DATOS DEPORTISTAS'!I107","v":"CADETE"},{"$f":"'DATOS DEPORTISTAS'!M107","v":"VÍCTOR CINCA GARCÍA"}]
[null,{"$f":"'DATOS DEPORTISTAS'!V108","v":"CENTRO NATACION HELIOS"},{"$f":"'DATOS DEPORTISTAS'!I108","v":"VETERANO"},{"$f":"'DATOS DEPORTISTAS'!M108","v":"DIEGO DE LAS CASAS JIMÉNEZ"}]
[null,{"$f":"'DATOS DEPORTISTAS'!V109","v":"CENTRO NATACION HELIOS"},{"$f":"'DATOS DEPORTISTAS'!I109","v":"VETERANO"},{"$f":"'DATOS DEPORTISTAS'!M109","v":"ANDRÉS DÍAZ ROBLES"}]
[null,{"$f":"'DATOS DEPORTISTAS'!V110","v":"CENTRO NATACION HELIOS"},{"$f":"'DATOS DEPORTISTAS'!I110","v":"SENIOR"},{"$f":"'DATOS DEPORTISTAS'!M110","v":"PEDRO DIEZ GARCÍA"}]
[null,{"$f":"'DATOS DEPORTISTAS'!V111","v":"CENTRO NATACION HELIOS"},{"$f":"'DATOS DEPORTISTAS'!I111","v":"VETERANO"},{"$f":"'DATOS DEPORTISTAS'!M111","v":"ALFREDO DIEZ SECO"}]
[null,{"$f":"'DATOS DEPORTISTAS'!V112","v":"CENTRO NATACION HELIOS"},{"$f":"'DATOS DEPORTISTAS'!I112","v":"BENJAMIN"},{"$f":"'DATOS DEPORTISTAS'!M112","v":"JIMENA ESPADA CIPRÉS"}]
[null,{"$f":"'DATOS DEPORTISTAS'!V113","v":"CENTRO NATACION HELIOS"},{"$f":"'DATOS DEPORTISTAS'!I113","v":"ALEVIN"},{"$f":"'DATOS DEPORTISTAS'!M113","v":"VALENTINA ESPADA CIPRÉS"}]
[null,{"$f":"'DATOS DEPORTISTAS'!V114","v":"CENTRO NATACION HELIOS"},{"$f":"'DATOS DEPORTISTAS'!I114","v":"VETERANO"},{"$f":"'DATOS DEPORTISTAS'!M114","v":"VÍCTOR ESTEBAN GRAN"}]
[null,{"$f":"'DATOS DEPORTISTAS'!V115","v":"CENTRO NATACION HELIOS"},{"$f":"'DATOS DEPORTISTAS'!I115","v":"CADETE"},{"$f":"'DATOS DEPORTISTAS'!M115","v":"JOSÉ MANUEL FAÑA GRIÑÓN"}]
[null,{"$f":"'DATOS DEPORTISTAS'!V116","v":"CENTRO NATACION HELIOS"},{"$f":"'DATOS DEPORTISTAS'!I116","v":"JUVENIL"},{"$f":"'DATOS DEPORTISTAS'!M116","v":"NOA FUERTES VALLÉS"}]
[null,{"$f":"'DATOS DEPORTISTAS'!V117","v":"CENTRO NATACION HELIOS"},{"$f":"'DATOS DEPORTISTAS'!I117","v":"SENIOR"},{"$f":"'DATOS DEPORTISTAS'!M117","v":"TRISTÁN GASCÓN MARCHAL"}]
[null,{"$f":"'DATOS DEPORTISTAS'!V118","v":"CENTRO NATACION HELIOS"},{"$f":"'DATOS DEPORTISTAS'!I118","v":"JUVENIL"},{"$f":"'DATOS DEPORTISTAS'!M118","v":"MANUEL GIRONÉS BENAVENTE"}]
[null,{"$f":"'DATOS DEPORTISTAS'!V119","v":"CENTRO NATACION HELIOS"},{"$f":"'DATOS DEPORTISTAS'!I119","v":"INFANTIL"},{"$f":"'DATOS DEPORTISTAS'!M119","v":"GUILLERMO GUTIÉRREZ ANDOLZ"}]
[null,{"$f":"'DATOS DEPORTISTAS'!V120","v":"CENTRO NATACION HELIOS"},{"$f":"'DATOS DEPORTISTAS'!I120","v":"INFANTIL"},{"$f":"'DATOS DEPORTISTAS'!M120","v":"IAGO IGLESIAS DELGADO"}]
[null,{"$f":"'DATOS DEPORTISTAS'!V121","v":"CENTRO NATACION HELIOS"},{"$f":"'DATOS DEPORTISTAS'!I121","v":"JUVENIL"},{"$f":"'DATOS DEPORTISTAS'!M121","v":"DIEGO JIMÉNEZ HORNOS"}]
[null,{"$f":"'DATOS DEPORTISTAS'!V122","v":"CENTRO NATACION HELIOS"},{"$f":"'DATOS DEPORTISTAS'!I122","v":"SENIOR"},{"$f":"'DATOS DEPORTISTAS'!M122","v":"ALEXANDER JURADO PÉREZ"}]
[null,{"$f":"'DATOS DEPORTISTAS'!V123","v":"CENTRO NATACION HELIOS"},{"$f":"'DATOS DEPORTISTAS'!I123","v":"VETERANO"},{"$f":"'DATOS DEPORTISTAS'!M123","v":"JOSÉ LACASTA AISA"}]
[null,{"$f":"'DATOS DEPORTISTAS'!V124","v":"CENTRO NATACION HELIOS"},{"$f":"'DATOS DEPORTISTAS'!I124","v":"SENIOR"},{"$f":"'DATOS DEPORTISTAS'!M124","v":"FRANCISCO DE ASÍS LACRUZ SANZ"}]
[null,{"$f":"'DATOS DEPORTISTAS'!V125","v":"CENTRO NATACION HELIOS"},{"$f":"'DATOS DEPORTISTAS'!I125","v":"VETERANO"},{"$f":"'DATOS DEPORTISTAS'!M125","v":"IVÁN LATAS JIMÉNEZ"}]
[null,{"$f":"'DATOS DEPORTISTAS'!V126","v":"CENTRO NATACION HELIOS"},{"$f":"'DATOS DEPORTISTAS'!I126","v":"INFANTIL"},{"$f":"'DATOS DEPORTISTAS'!M126","v":"BRUNO LÁZARO QUÍLEZ"}]
[null,{"$f":"'DATOS DEPORTISTAS'!V127","v":"CENTRO NATACION HELIOS"},{"$f":"'DATOS DEPORTISTAS'!I127","v":"SENIOR"},{"$f":"'DATOS DEPORTISTAS'!M127","v":"JUAN LERMA IRURETA"}]
[null,{"$f":"'DATOS DEPORTISTAS'!V128","v":"CENTRO NATACION HELIOS"},{"$f":"'DATOS DEPORTISTAS'!I128","v":"INFANTIL"},{"$f":"'DATOS DEPORTISTAS'!M128","v":"ALICIA LUNA MONTAGUD"}]
[null,{"$f":"'DATOS DEPORTISTAS'!V129","v":"CENTRO NATACION HELIOS"},{"$f":"'DATOS DEPORTISTAS'!I129","v":"ALEVIN"},{"$f":"'DATOS DEPORTISTAS'!M129","v":"JORGE LUNA MONTAGUD"}]
[null,{"$f":"'DATOS DEPORTISTAS'!V130","v":"CENTRO NATACION HELIOS"},{"$f":"'DATOS DEPORTISTAS'!I130","v":"JUVENIL"},{"$f":"'DATOS DEPORTISTAS'!M130","v":"PABLO MALO VELA"}]
[null,{"$f":"'DATOS DEPORTISTAS'!V131","v":"CENTRO NATACION HELIOS"},{"$f":"'DATOS DEPORTISTAS'!I131","v":"SENIOR"},{"$f":"'DATOS DEPORTISTAS'!M131","v":"PILAR MARCÉN GUTIÉRREZ"}]
[null,{"$f":"'DATOS DEPORTISTAS'!V132","v":"CENTRO NATACION HELIOS"},{"$f":"'DATOS DEPORTISTAS'!I132","v":"JUVENIL"},{"$f":"'DATOS DEPORTISTAS'!M132","v":"NIL MARTÍN BERNARDOS"}]
[null,{"$f":"'DATOS DEPORTISTAS'!V133","v":"CENTRO NATACION HELIOS"},{"$f":"'DATOS DEPORTISTAS'!I133","v":"CADETE"},{"$f":"'DATOS DEPORTISTAS'!M133","v":"FERNANDO MARTÍN RANERA"}]
[null,{"$f":"'DATOS DEPORTISTAS'!V134","v":"CENTRO NATACION HELIOS"},{"$f":"'DATOS DEPORTISTAS'!I134","v":"JUVENIL"},{"$f":"'DATOS DEPORTISTAS'!M134","v":"MARCO MELÉNDEZ DEL PICO"}]
[null,{"$f":"'DATOS DEPORTISTAS'!V135","v":"CENTRO NATACION HELIOS"},{"$f":"'DATOS DEPORTISTAS'!I135","v":"CADETE"},{"$f":"'DATOS DEPORTISTAS'!M135","v":"CHLOÉ MILLÁN GÓMEZ"}]
[null,{"$f":"'DATOS DEPORTISTAS'!V136","v":"CENTRO NATACION HELIOS"},{"$f":"'DATOS DEPORTISTAS'!I136","v":"INFANTIL"},{"$f":"'DATOS DEPORTISTAS'!M136","v":"MARTÍN MILLÁN GÓMEZ"}]
[null,{"$f":"'DATOS DEPORTISTAS'!V137","v":"CENTRO NATACION HELIOS"},{"$f":"'DATOS DEPORTISTAS'!I137","v":"ALEVIN"},{"$f":"'DATOS DEPORTISTAS'!M137","v":"LUCÍA MONTANER ALFARO"}]
[null,{"$f":"'DATOS DEPORTISTAS'!V138","v":"CENTRO NATACION HELIOS"},{"$f":"'DATOS DEPORTISTAS'!I138","v":"JUVENIL"},{"$f":"'DATOS DEPORTISTAS'!M138","v":"MARTÍN MONTANER ALFARO"}]
[null,{"$f":"'DATOS DEPORTISTAS'!V139","v":"CENTRO NATACION HELIOS"},{"$f":"'DATOS DEPORTISTAS'!I139","v":"CADETE"},{"$f":"'DATOS DEPORTISTAS'!M139","v":"SOFÍA MONTANER ALFARO"}]
[null,{"$f":"'DATOS DEPORTISTAS'!V140","v":"CENTRO NATACION HELIOS"},{"$f":"'DATOS DEPORTISTAS'!I140","v":"VETERANO"},{"$f":"'DATOS DEPORTISTAS'!M140","v":"RAFAEL MONTANER MARTÍN"}]
[null,{"$f":"'DATOS DEPORTISTAS'!V141","v":"CENTRO NATACION HELIOS"},{"$f":"'DATOS DEPORTISTAS'!I141","v":"VETERANO"},{"$f":"'DATOS DEPORTISTAS'!M141","v":"JORGE PEIRÓ MESA"}]
[null,{"$f":"'DATOS DEPORTISTAS'!V142","v":"CENTRO NATACION HELIOS"},{"$f":"'DATOS DEPORTISTAS'!I142","v":"VETERANO"},{"$f":"'DATOS DEPORTISTAS'!M142","v":"MARÍA PILAR PEÑA HERRERO"}]
[null,{"$f":"'DATOS DEPORTISTAS'!V143","v":"CENTRO NATACION HELIOS"},{"$f":"'DATOS DEPORTISTAS'!I143","v":"VETERANO"},{"$f":"'DATOS DEPORTISTAS'!M143","v":"IVÁN PÉREZ RODRÍGUEZ"}]
[null,{"$f":"'DATOS DEPORTISTAS'!V144","v":"CENTRO NATACION HELIOS"},{"$f":"'DATOS DEPORTISTAS'!I144","v":"VETERANO"},{"$f":"'DATOS DEPORTISTAS'!M144","v":"MIGUEL ÁNGEL PÉREZ VICENTE"}]
[null,{"$f":"'DATOS DEPORTISTAS'!V145","v":"CENTRO NATACION HELIOS"},{"$f":"'DATOS DEPORTISTAS'!I145","v":"VETERANO"},{"$f":"'DATOS DEPORTISTAS'!M145","v":"GREGORIO PRADAS QUERO"}]
[null,{"$f":"'DATOS DEPORTISTAS'!V146","v":"CENTRO NATACION HELIOS"},{"$f":"'DATOS DEPORTISTAS'!I146","v":"ALEVIN"},{"$f":"'DATOS DEPORTISTAS'!M146","v":"ADELA RELANCIO PASTOR"}]
[null,{"$f":"'DATOS DEPORTISTAS'!V147","v":"CENTRO NATACION HELIOS"},{"$f":"'DATOS DEPORTISTAS'!I147","v":"BENJAMIN"},{"$f":"'DATOS DEPORTISTAS'!M147","v":"ALMA RELANCIO PASTOR"}]
[null,{"$f":"'DATOS DEPORTISTAS'!V148","v":"CENTRO NATACION HELIOS"},{"$f":"'DATOS DEPORTISTAS'!I148","v":"BENJAMIN"},{"$f":"'DATOS DEPORTISTAS'!M148","v":"ÁNGELA RELANCIO PASTOR"}]
[null,{"$f":"'DATOS DEPORTISTAS'!V149","v":"CENTRO NATACION HELIOS"},{"$f":"'DATOS DEPORTISTAS'!I149","v":"CADETE"},{"$f":"'DATOS DEPORTISTAS'!M149","v":"JAVIER REMACHA PUSCO"}]
[null,{"$f":"'DATOS DEPORTISTAS'!V150","v":"CENTRO NATACION HELIOS"},{"$f":"'DATOS DEPORTISTAS'!I150","v":"SENIOR"},{"$f":"'DATOS DEPORTISTAS'!M150","v":"KARLA REMACHA PUSCO"}]
[null,{"$f":"'DATOS DEPORTISTAS'!V151","v":"CENTRO NATACION HELIOS"},{"$f":"'DATOS DEPORTISTAS'!I151","v":"SENIOR"},{"$f":"'DATOS DEPORTISTAS'!M151","v":"MARÍA ROMEO VICENTE"}]
[null,{"$f":"'DATOS DEPORTISTAS'!V152","v":"CENTRO NATACION HELIOS"},{"$f":"'DATOS DEPORTISTAS'!I152","v":"BENJAMIN"},{"$f":"'DATOS DEPORTISTAS'!M152","v":"ÁNGEL ROYO LAVILLA"}]
[null,{"$f":"'DATOS DEPORTISTAS'!V153","v":"CENTRO NATACION HELIOS"},{"$f":"'DATOS DEPORTISTAS'!I153","v":"VETERANO"},{"$f":"'DATOS DEPORTISTAS'!M153","v":"RUTH SÁEZ LARREA"}]
[null,{"$f":"'DATOS DEPORTISTAS'!V154","v":"CENTRO NATACION HELIOS"},{"$f":"'DATOS DEPORTISTAS'!I154","v":"VETERANO"},{"$f":"'DATOS DEPORTISTAS'!M154","v":"JUAN JOSÉ SALAS IBÁÑEZ"}]
[null,{"$f":"'DATOS DEPORTISTAS'!V155","v":"CENTRO NATACION HELIOS"},{"$f":"'DATOS DEPORTISTAS'!I155","v":"VETERANO"},{"$f":"'DATOS DEPORTISTAS'!M155","v":"JOSÉ TABUENCA COLERA"}]
[null,{"$f":"'DATOS DEPORTISTAS'!V156","v":"CENTRO NATACION HELIOS"},{"$f":"'DATOS DEPORTISTAS'!I156","v":"JUVENIL"},{"$f":"'DATOS DEPORTISTAS'!M156","v":"ISABEL TOVAR GODOY"}]
[null,{"$f":"'DATOS DEPORTISTAS'!V157","v":"CENTRO NATACION HELIOS"},{"$f":"'DATOS DEPORTISTAS'!I157","v":"CADETE"},{"$f":"'DATOS DEPORTISTAS'!M157","v":"JUAN TOVAR GODOY"}]
[null,{"$f":"'DATOS DEPORTISTAS'!V158","v":"CENTRO NATACION HELIOS"},{"$f":"'DATOS DEPORTISTAS'!I158","v":"CADETE"},{"$f":"'DATOS DEPORTISTAS'!M158","v":"GERMÁN VILLORO ANGLÉS"}]
[null,{"$f":"'DATOS DEPORTISTAS'!V159","v":"CENTRO NATACION HELIOS"},{"$f":"'DATOS DEPORTISTAS'!I159","v":"VETERANO"},{"$f":"'DATOS DEPORTISTAS'!M159","v":"ANTONIO MIGUEL VILLORO GRASKE"}]
[null,{"$f":"'DATOS DEPORTISTAS'!V160","v":"CENTRO NATACION HELIOS"},{"$f":"'DATOS DEPORTISTAS'!I160","v":"JUVENIL"},{"$f":"'DATOS DEPORTISTAS'!M160","v":"ALICIA YÁÑEZ MARTÍNEZ"}]
[null,{"$f":"'DATOS DEPORTISTAS'!V161","v":"CENTRO NATACION HELIOS"},{"$f":"'DATOS DEPORTISTAS'!I161","v":"SENIOR"},{"$f":"'DATOS DEPORTISTAS'!M161","v":"ÍÑIGO MIGUEL ZAPATA LARROY"}]
[null,{"$f":"'DATOS DEPORTISTAS'!V162","v":"CAPRI MEQUINENZA"},{"$f":"'DATOS DEPORTISTAS'!I162","v":"JUVENIL"},{"$f":"'DATOS DEPORTISTAS'!M162","v":"AARÓN MÁRQUEZ GUARDIOLA"}]
[null,{"$f":"'DATOS DEPORTISTAS'!V163","v":"CAPRI MEQUINENZA"},{"$f":"'DATOS DEPORTISTAS'!I163","v":"CADETE"},{"$f":"'DATOS DEPORTISTAS'!M163","v":"ERIKA GODIA NICOLAU"}]
[null,{"$f":"'DATOS DEPORTISTAS'!V164","v":"CAPRI MEQUINENZA"},{"$f":"'DATOS DEPORTISTAS'!I164","v":"JUVENIL"},{"$f":"'DATOS DEPORTISTAS'!M164","v":"IVÁN GODIA SANCHO"}]
[null,{"$f":"'DATOS DEPORTISTAS'!V165","v":"CAPRI MEQUINENZA"},{"$f":"'DATOS DEPORTISTAS'!I165","v":"BENJAMIN"},{"$f":"'DATOS DEPORTISTAS'!M165","v":"NOA  GARCIA SERRANO"}]
[null,{"$f":"'DATOS DEPORTISTAS'!V166","v":"CAPRI MEQUINENZA"},{"$f":"'DATOS DEPORTISTAS'!I166","v":"CADETE"},{"$f":"'DATOS DEPORTISTAS'!M166","v":"SOFÍA SERVETO ORDUÑA"}]
[null,{"$f":"'DATOS DEPORTISTAS'!V167","v":"CAPRI MEQUINENZA"},{"$f":"'DATOS DEPORTISTAS'!I167","v":"JUVENIL"},{"$f":"'DATOS DEPORTISTAS'!M167","v":"TIBERIU GABRIEL DAMIÁN"}]
[null,{"$f":"'DATOS DEPORTISTAS'!V168","v":"CAPRI MEQUINENZA"},{"$f":"'DATOS DEPORTISTAS'!I168","v":"SENIOR"},{"$f":"'DATOS DEPORTISTAS'!M168","v":"CARLA MARÍA TEIRA ARBIOL"}]
[null,{"$f":"'DATOS DEPORTISTAS'!V169","v":"CAPRI MEQUINENZA"},{"$f":"'DATOS DEPORTISTAS'!I169","v":"SENIOR"},{"$f":"'DATOS DEPORTISTAS'!M169","v":"HELENA BERNAL LACRUZ"}]
[null,{"$f":"'DATOS DEPORTISTAS'!V170","v":"CAPRI MEQUINENZA"},{"$f":"'DATOS DEPORTISTAS'!I170","v":"VETERANO"},{"$f":"'DATOS DEPORTISTAS'!M170","v":"JESÚS MANUEL LLOP MONTULL"}]
[null,{"$f":"'DATOS DEPORTISTAS'!V171","v":"CAPRI MEQUINENZA"},{"$f":"'DATOS DEPORTISTAS'!I171","v":"VETERANO"},{"$f":"'DATOS DEPORTISTAS'!M171","v":"MARCELO ITHARTE"}]
[null,{"$f":"'DATOS DEPORTISTAS'!V172","v":"CAPRI MEQUINENZA"},{"$f":"'DATOS DEPORTISTAS'!I172","v":"SENIOR"},{"$f":"'DATOS DEPORTISTAS'!M172","v":"MARÍA PILAR GODIA PI"}]
[null,{"$f":"'DATOS DEPORTISTAS'!V173","v":"CAPRI MEQUINENZA"},{"$f":"'DATOS DEPORTISTAS'!I173","v":"VETERANO"},{"$f":"'DATOS DEPORTISTAS'!M173","v":"OLIVER FERNÁNDEZ GIL"}]
[null,{"$f":"'DATOS DEPORTISTAS'!V174","v":"CAPRI MEQUINENZA"},{"$f":"'DATOS DEPORTISTAS'!I174","v":"VETERANO"},{"$f":"'DATOS DEPORTISTAS'!M174","v":"ROSA MARÍA LLOP RIAU"}]
[null,{"$f":"'DATOS DEPORTISTAS'!V175","v":"CAPRI MEQUINENZA"},{"$f":"'DATOS DEPORTISTAS'!I175","v":"SENIOR"},{"$f":"'DATOS DEPORTISTAS'!M175","v":"SARA SERVETO ORDUÑA"}]
[null,{"$f":"'DATOS DEPORTISTAS'!V176","v":"CAPRI MEQUINENZA"},{"$f":"'DATOS DEPORTISTAS'!I176","v":"VETERANO"},{"$f":"'DATOS DEPORTISTAS'!M176","v":"PEDRO JOSÉ SERVETO PALOMAR"}]
[null,{"$f":"'DATOS DEPORTISTAS'!V177","v":"CENTRO NATACION HELIOS"},{"$f":"'DATOS DEPORTISTAS'!I177","v":"CADETE"},{"$f":"'DATOS DEPORTISTAS'!M177","v":"JIMENA ALCÁNTARA BUATAS"}]
[null,{"$f":"'DATOS DEPORTISTAS'!V178","v":"CENTRO NATACION HELIOS"},{"$f":"'DATOS DEPORTISTAS'!I178","v":"VETERANO"},{"$f":"'DATOS DEPORTISTAS'!M178","v":"PEDRO BENITO ARANDA MARTÍNEZ"}]
[null,{"$f":"'DATOS DEPORTISTAS'!V179","v":"CENTRO NATACION HELIOS"},{"$f":"'DATOS DEPORTISTAS'!I179","v":"VETERANO"},{"$f":"'DATOS DEPORTISTAS'!M179","v":"JOSÉ MANUEL BIELSA ARTIDIELLO"}]
[null,{"$f":"'DATOS DEPORTISTAS'!V180","v":"CENTRO NATACION HELIOS"},{"$f":"'DATOS DEPORTISTAS'!I180","v":"VETERANO"},{"$f":"'DATOS DEPORTISTAS'!M180","v":"ELOY GARCÉS BALLERTE"}]
[null,{"$f":"'DATOS DEPORTISTAS'!V181","v":"CENTRO NATACION HELIOS"},{"$f":"'DATOS DEPORTISTAS'!I181","v":"JUVENIL"},{"$f":"'DATOS DEPORTISTAS'!M181","v":"MARGARET HONENSHLT"}]
[null,{"$f":"'DATOS DEPORTISTAS'!V182","v":"CENTRO NATACION HELIOS"},{"$f":"'DATOS DEPORTISTAS'!I182","v":"BENJAMIN"},{"$f":"'DATOS DEPORTISTAS'!M182","v":"VÍCTOR LENNIKOV IGLESIAS"}]
[null,{"$f":"'DATOS DEPORTISTAS'!V183","v":"CENTRO NATACION HELIOS"},{"$f":"'DATOS DEPORTISTAS'!I183","v":"VETERANO"},{"$f":"'DATOS DEPORTISTAS'!M183","v":"SYLVIA MARÍA MELO HURTADO"}]
[null,{"$f":"'DATOS DEPORTISTAS'!V184","v":"CENTRO NATACION HELIOS"},{"$f":"'DATOS DEPORTISTAS'!I184","v":"VETERANO"},{"$f":"'DATOS DEPORTISTAS'!M184","v":"PEDRO MARÍA NAVARRO SANGüESA"}]
[null,{"$f":"'DATOS DEPORTISTAS'!V185","v":"CENTRO NATACION HELIOS"},{"$f":"'DATOS DEPORTISTAS'!I185","v":"SENIOR"},{"$f":"'DATOS DEPORTISTAS'!M185","v":"JAVIER MUNIESA AGUAS"}]
[null,{"$f":"'DATOS DEPORTISTAS'!V186","v":"CENTRO NATACION HELIOS"},{"$f":"'DATOS DEPORTISTAS'!I186","v":"VETERANO"},{"$f":"'DATOS DEPORTISTAS'!M186","v":"JOSÉ GABRIEL SEBASTIÁN BELANCHE"}]
[null,{"$f":"'DATOS DEPORTISTAS'!V187","v":"CENTRO NATACION HELIOS"},{"$f":"'DATOS DEPORTISTAS'!I187","v":"VETERANO"},{"$f":"'DATOS DEPORTISTAS'!M187","v":"MARIA ÁNGELES PASTOR MONTAÑO"}]
[null,{"$f":"'DATOS DEPORTISTAS'!V188","v":"CENTRO NATACION HELIOS"},{"$f":"'DATOS DEPORTISTAS'!I188","v":"CADETE"},{"$f":"'DATOS DEPORTISTAS'!M188","v":"DAVID SINUSIA LAVIL"}]
[null,{"$f":"'DATOS DEPORTISTAS'!V189","v":"CENTRO NATACION HELIOS"},{"$f":"'DATOS DEPORTISTAS'!I189","v":"JUVENIL"},{"$f":"'DATOS DEPORTISTAS'!M189","v":"SANDRA DIEZ GARCÍA"}]
[null,{"$f":"'DATOS DEPORTISTAS'!V190","v":"OS NABATERS D.F."},{"$f":"'DATOS DEPORTISTAS'!I190","v":"VETERANO"},{"$f":"'DATOS DEPORTISTAS'!M190","v":"NAOMI SANCHO BUSTÍN"}]
[null,{"$f":"'DATOS DEPORTISTAS'!V191","v":"OS NABATERS D.F."},{"$f":"'DATOS DEPORTISTAS'!I191","v":"VETERANO"},{"$f":"'DATOS DEPORTISTAS'!M191","v":"RICARDO SALILLAS MARTÍNEZ"}]
[null,{"$f":"'DATOS DEPORTISTAS'!V192","v":"OS NABATERS D.F."},{"$f":"'DATOS DEPORTISTAS'!I192","v":"VETERANO"},{"$f":"'DATOS DEPORTISTAS'!M192","v":"OMAR SEBASTIÁN BUSTÍN"}]
[null,{"$f":"'DATOS DEPORTISTAS'!V193","v":"OS NABATERS D.F."},{"$f":"'DATOS DEPORTISTAS'!I193","v":"SENIOR"},{"$f":"'DATOS DEPORTISTAS'!M193","v":"ALODIA SANCHO BUSTÍN"}]
[null,{"$f":"'DATOS DEPORTISTAS'!V194","v":"OS NABATERS D.F."},{"$f":"'DATOS DEPORTISTAS'!I194","v":"VETERANO"},{"$f":"'DATOS DEPORTISTAS'!M194","v":"LUIS JAVIER MELERO PASCUAL"}]
[null,{"$f":"'DATOS DEPORTISTAS'!V195","v":"OS NABATERS D.F."},{"$f":"'DATOS DEPORTISTAS'!I195","v":"VETERANO"},{"$f":"'DATOS DEPORTISTAS'!M195","v":"ANTONIO ANSELMO SANCHO NAVARRO"}]
[null,{"$f":"'DATOS DEPORTISTAS'!V196","v":"OS NABATERS D.F."},{"$f":"'DATOS DEPORTISTAS'!I196","v":"VETERANO"},{"$f":"'DATOS DEPORTISTAS'!M196","v":"JOSÉ MARÍA EMBARBA LABORDA"}]
[null,{"$f":"'DATOS DEPORTISTAS'!V197","v":"OS NABATERS D.F."},{"$f":"'DATOS DEPORTISTAS'!I197","v":"VETERANO"},{"$f":"'DATOS DEPORTISTAS'!M197","v":"LUIS CARLOS BELLED LACASA"}]
[null,{"$f":"'DATOS DEPORTISTAS'!V198","v":"OS NABATERS D.F."},{"$f":"'DATOS DEPORTISTAS'!I198","v":"VETERANO"},{"$f":"'DATOS DEPORTISTAS'!M198","v":"ÁNGEL AGUILERA ANDRÉS"}]
[null,{"$f":"'DATOS DEPORTISTAS'!V199","v":"OS NABATERS D.F."},{"$f":"'DATOS DEPORTISTAS'!I199","v":"VETERANO"},{"$f":"'DATOS DEPORTISTAS'!M199","v":"PEDRO DANIEL PLOU ARTAL"}]
[null,{"$f":"'DATOS DEPORTISTAS'!V200","v":"OS NABATERS D.F."},{"$f":"'DATOS DEPORTISTAS'!I200","v":"VETERANO"},{"$f":"'DATOS DEPORTISTAS'!M200","v":"JOSÉ IGNACIO MAGDALENA ABAD"}]
[null,{"$f":"'DATOS DEPORTISTAS'!V201","v":"OS NABATERS D.F."},{"$f":"'DATOS DEPORTISTAS'!I201","v":"VETERANO"},{"$f":"'DATOS DEPORTISTAS'!M201","v":"ISCICIO NAVARRETE SÁNCHEZ"}]
[null,{"$f":"'DATOS DEPORTISTAS'!V202","v":"OS NABATERS D.F."},{"$f":"'DATOS DEPORTISTAS'!I202","v":"VETERANO"},{"$f":"'DATOS DEPORTISTAS'!M202","v":"ALEJANDRO DEL AMO SANCHO"}]
[null,{"$f":"'DATOS DEPORTISTAS'!V203","v":"OS NABATERS D.F."},{"$f":"'DATOS DEPORTISTAS'!I203","v":"JUVENIL"},{"$f":"'DATOS DEPORTISTAS'!M203","v":"ADRIÁN AZNAR SAMPER"}]
[null,{"$f":"'DATOS DEPORTISTAS'!V204","v":"OS NABATERS D.F."},{"$f":"'DATOS DEPORTISTAS'!I204","v":"VETERANO"},{"$f":"'DATOS DEPORTISTAS'!M204","v":"SUSANA ESTABLÉS SUJÁN"}]
[null,{"$f":"'DATOS DEPORTISTAS'!V205","v":"OS NABATERS D.F."},{"$f":"'DATOS DEPORTISTAS'!I205","v":"SENIOR"},{"$f":"'DATOS DEPORTISTAS'!M205","v":"RAQUEL HERNÁNDEZ ROYO"}]
[null,{"$f":"'DATOS DEPORTISTAS'!V206","v":"OS NABATERS D.F."},{"$f":"'DATOS DEPORTISTAS'!I206","v":"SENIOR"},{"$f":"'DATOS DEPORTISTAS'!M206","v":"JESÚS MARÍA VILLAR QUINTANA"}]
[null,{"$f":"'DATOS DEPORTISTAS'!V207","v":"OS NABATERS D.F."},{"$f":"'DATOS DEPORTISTAS'!I207","v":"VETERANO"},{"$f":"'DATOS DEPORTISTAS'!M207","v":"JOSÉ LUIS HERNÁNDEZ PASCUAL"}]
[null,{"$f":"'DATOS DEPORTISTAS'!V208","v":"OS NABATERS D.F."},{"$f":"'DATOS DEPORTISTAS'!I208","v":"VETERANO"},{"$f":"'DATOS DEPORTISTAS'!M208","v":"IGNACIO HERNÁNDEZ ARAGÜET"}]
[null,{"$f":"'DATOS DEPORTISTAS'!V209","v":"OS NABATERS D.F."},{"$f":"'DATOS DEPORTISTAS'!I209","v":"VETERANO"},{"$f":"'DATOS DEPORTISTAS'!M209","v":"JOSÉ ÁNGEL GRACIA AGUSTÍN"}]
[null,{"$f":"'DATOS DEPORTISTAS'!V210","v":"OS NABATERS D.F."},{"$f":"'DATOS DEPORTISTAS'!I210","v":"JUVENIL"},{"$f":"'DATOS DEPORTISTAS'!M210","v":"SARA MARTÍN RANERA"}]
[null,{"$f":"'DATOS DEPORTISTAS'!V211","v":"OS NABATERS D.F."},{"$f":"'DATOS DEPORTISTAS'!I211","v":"JUVENIL"},{"$f":"'DATOS DEPORTISTAS'!M211","v":"GERMÁN FAUBELL MACÍA"}]
[null,{"$f":"'DATOS DEPORTISTAS'!V212","v":"OS NABATERS D.F."},{"$f":"'DATOS DEPORTISTAS'!I212","v":"VETERANO"},{"$f":"'DATOS DEPORTISTAS'!M212","v":"JOSÉ LUIS CAMBERO CENZANO"}]
[null,{"$f":"'DATOS DEPORTISTAS'!V213","v":"OS NABATERS D.F."},{"$f":"'DATOS DEPORTISTAS'!I213","v":"SENIOR"},{"$f":"'DATOS DEPORTISTAS'!M213","v":"JORGE PONCE USÓN"}]
[null,{"$f":"'DATOS DEPORTISTAS'!V214","v":"OS NABATERS D.F."},{"$f":"'DATOS DEPORTISTAS'!I214","v":"SENIOR"},{"$f":"'DATOS DEPORTISTAS'!M214","v":"GUILLÉN VICENTE MIRANDA"}]
[null,{"$f":"'DATOS DEPORTISTAS'!V215","v":"OS NABATERS D.F."},{"$f":"'DATOS DEPORTISTAS'!I215","v":"VETERANO"},{"$f":"'DATOS DEPORTISTAS'!M215","v":"MIGUEL BEA GONZÁLEZ"}]
[null,{"$f":"'DATOS DEPORTISTAS'!V216","v":"OS NABATERS D.F."},{"$f":"'DATOS DEPORTISTAS'!I216","v":"BENJAMIN"},{"$f":"'DATOS DEPORTISTAS'!M216","v":"VÍCTOR IVZHENKO"}]
[null,{"$f":"'DATOS DEPORTISTAS'!V217","v":"OS NABATERS D.F."},{"$f":"'DATOS DEPORTISTAS'!I217","v":"VETERANO"},{"$f":"'DATOS DEPORTISTAS'!M217","v":"MERCEDES GIMÉNEZ HERRERO"}]
[null,{"$f":"'DATOS DEPORTISTAS'!V218","v":"OS NABATERS D.F."},{"$f":"'DATOS DEPORTISTAS'!I218","v":"VETERANO"},{"$f":"'DATOS DEPORTISTAS'!M218","v":"ABEL RICARDO OVALLES GUERRA"}]
[null,{"$f":"'DATOS DEPORTISTAS'!V219","v":"OS NABATERS D.F."},{"$f":"'DATOS DEPORTISTAS'!I219","v":"INFANTIL"},{"$f":"'DATOS DEPORTISTAS'!M219","v":"DAVID MARCOS GARCÍA"}]
[null,{"$f":"'DATOS DEPORTISTAS'!V220","v":"OS NABATERS D.F."},{"$f":"'DATOS DEPORTISTAS'!I220","v":"VETERANO"},{"$f":"'DATOS DEPORTISTAS'!M220","v":"ROBERTO NAVARRO CARRETERO"}]
[null,{"$f":"'DATOS DEPORTISTAS'!V221","v":"OS NABATERS D.F."},{"$f":"'DATOS DEPORTISTAS'!I221","v":"CADETE"},{"$f":"'DATOS DEPORTISTAS'!M221","v":"DARÍO CANO JIMÉNEZ"}]
[null,{"$f":"'DATOS DEPORTISTAS'!V222","v":"OS NABATERS D.F."},{"$f":"'DATOS DEPORTISTAS'!I222","v":"INFANTIL"},{"$f":"'DATOS DEPORTISTAS'!M222","v":"CÉSAR DÍEZ MOZOTA"}]
[null,{"$f":"'DATOS DEPORTISTAS'!V223","v":"OS NABATERS D.F."},{"$f":"'DATOS DEPORTISTAS'!I223","v":"VETERANO"},{"$f":"'DATOS DEPORTISTAS'!M223","v":"RAÚL DÍEZ DÍEZ"}]
[null,{"$f":"'DATOS DEPORTISTAS'!V224","v":"OS NABATERS D.F."},{"$f":"'DATOS DEPORTISTAS'!I224","v":"VETERANO"},{"$f":"'DATOS DEPORTISTAS'!M224","v":"DAVID OLMO NADAL"}]
[null,{"$f":"'DATOS DEPORTISTAS'!V225","v":"OS NABATERS D.F."},{"$f":"'DATOS DEPORTISTAS'!I225","v":"SENIOR"},{"$f":"'DATOS DEPORTISTAS'!M225","v":"ELENA CID RUIZ"}]
[null,{"$f":"'DATOS DEPORTISTAS'!V226","v":"OS NABATERS D.F."},{"$f":"'DATOS DEPORTISTAS'!I226","v":"VETERANO"},{"$f":"'DATOS DEPORTISTAS'!M226","v":"ANDREA MATAIX MONTANER"}]
[null,{"$f":"'DATOS DEPORTISTAS'!V227","v":"OS NABATERS D.F."},{"$f":"'DATOS DEPORTISTAS'!I227","v":"JUVENIL"},{"$f":"'DATOS DEPORTISTAS'!M227","v":"SARA BAILO GARCÍA"}]
[null,{"$f":"'DATOS DEPORTISTAS'!V228","v":"OS NABATERS D.F."},{"$f":"'DATOS DEPORTISTAS'!I228","v":"VETERANO"},{"$f":"'DATOS DEPORTISTAS'!M228","v":"JUAN ALEGRE TRIS"}]
[null,{"$f":"'DATOS DEPORTISTAS'!V229","v":"OS NABATERS D.F."},{"$f":"'DATOS DEPORTISTAS'!I229","v":"VETERANO"},{"$f":"'DATOS DEPORTISTAS'!M229","v":"JOSÉ LUIS MARTÍN ESCUÍN"}]
[null,{"$f":"'DATOS DEPORTISTAS'!V230","v":"OS NABATERS D.F."},{"$f":"'DATOS DEPORTISTAS'!I230","v":"INFANTIL"},{"$f":"'DATOS DEPORTISTAS'!M230","v":"MARÍA ADELINA MARTISCA SUSANU"}]
[null,{"$f":"'DATOS DEPORTISTAS'!V231","v":"OS NABATERS D.F."},{"$f":"'DATOS DEPORTISTAS'!I231","v":"JUVENIL"},{"$f":"'DATOS DEPORTISTAS'!M231","v":"LUIS FRANCISCO BOIRA GONZALO"}]
[null,{"$f":"'DATOS DEPORTISTAS'!V232","v":"OS NABATERS D.F."},{"$f":"'DATOS DEPORTISTAS'!I232","v":"VETERANO"},{"$f":"'DATOS DEPORTISTAS'!M232","v":"ÁNGEL DE MIGUEL BENITO"}]
[null,{"$f":"'DATOS DEPORTISTAS'!V233","v":"OS NABATERS D.F."},{"$f":"'DATOS DEPORTISTAS'!I233","v":"SENIOR"},{"$f":"'DATOS DEPORTISTAS'!M233","v":"ANA RUBIO EZPELETA"}]
[null,{"$f":"'DATOS DEPORTISTAS'!V234","v":"OS NABATERS D.F."},{"$f":"'DATOS DEPORTISTAS'!I234","v":"VETERANO"},{"$f":"'DATOS DEPORTISTAS'!M234","v":"EMANUEL ALEXANDRU-GEORGESCU"}]
[null,{"$f":"'DATOS DEPORTISTAS'!V235","v":"OS NABATERS D.F."},{"$f":"'DATOS DEPORTISTAS'!I235","v":"INFANTIL"},{"$f":"'DATOS DEPORTISTAS'!M235","v":"YUSRA SORKHABI"}]
[null,{"$f":"'DATOS DEPORTISTAS'!V236","v":"NAUTICO ZARAGOZA"},{"$f":"'DATOS DEPORTISTAS'!I236","v":"VETERANO"},{"$f":"'DATOS DEPORTISTAS'!M236","v":"CLEMENTE FERNANDO LABORDA VAL"}]
[null,{"$f":"'DATOS DEPORTISTAS'!V237","v":"NAUTICO ZARAGOZA"},{"$f":"'DATOS DEPORTISTAS'!I237","v":"VETERANO"},{"$f":"'DATOS DEPORTISTAS'!M237","v":"IGNACIO JOSÉ RUIZ IRIBARNE"}]
[null,{"$f":"'DATOS DEPORTISTAS'!V238","v":"NAUTICO ZARAGOZA"},{"$f":"'DATOS DEPORTISTAS'!I238","v":"VETERANO"},{"$f":"'DATOS DEPORTISTAS'!M238","v":"JOSÉ MANUEL LARROY CALVO"}]
[null,{"$f":"'DATOS DEPORTISTAS'!V239","v":"NAUTICO ZARAGOZA"},{"$f":"'DATOS DEPORTISTAS'!I239","v":"VETERANO"},{"$f":"'DATOS DEPORTISTAS'!M239","v":"TEODORO TOBOSO MORENO"}]
[null,{"$f":"'DATOS DEPORTISTAS'!V240","v":"CENTRO NATACION HELIOS"},{"$f":"'DATOS DEPORTISTAS'!I240","v":"SENIOR"},{"$f":"'DATOS DEPORTISTAS'!M240","v":"ALBERTO VILLARAVIZ CHAVES"}]
[null,{"$f":"'DATOS DEPORTISTAS'!V241","v":"OS NABATERS D.F."},{"$f":"'DATOS DEPORTISTAS'!I241","v":"SENIOR"},{"$f":"'DATOS DEPORTISTAS'!M241","v":"JAIME PEÑA ROMERO DE TEJADA"}]
[null,{"$f":"'DATOS DEPORTISTAS'!V242","v":"OS NABATERS D.F."},{"$f":"'DATOS DEPORTISTAS'!I242","v":"SENIOR"},{"$f":"'DATOS DEPORTISTAS'!M242","v":"ITZIAR MARURI GARCÍA"}]
[null,{"$f":"'DATOS DEPORTISTAS'!V243","v":"OS NABATERS D.F."},{"$f":"'DATOS DEPORTISTAS'!I243","v":"SENIOR"},{"$f":"'DATOS DEPORTISTAS'!M243","v":"ÁNGEL BERNAL LECINA"}]
[null,{"$f":"'DATOS DEPORTISTAS'!V244","v":"OS NABATERS D.F."},{"$f":"'DATOS DEPORTISTAS'!I244","v":"SENIOR"},{"$f":"'DATOS DEPORTISTAS'!M244","v":"RAÚL GRACIA ANDIANO"}]
[null,{"$f":"'DATOS DEPORTISTAS'!V245","v":"OS NABATERS D.F."},{"$f":"'DATOS DEPORTISTAS'!I245","v":"SENIOR"},{"$f":"'DATOS DEPORTISTAS'!M245","v":"TOMÁS PELAYO BENEDET"}]
[null,{"$f":"'DATOS DEPORTISTAS'!V246","v":"OS NABATERS D.F."},{"$f":"'DATOS DEPORTISTAS'!I246","v":"SENIOR"},{"$f":"'DATOS DEPORTISTAS'!M246","v":"TATIANA CANO GALLEGO"}]
[null,{"$f":"'DATOS DEPORTISTAS'!V247","v":"OS NABATERS D.F."},{"$f":"'DATOS DEPORTISTAS'!I247","v":"SENIOR"},{"$f":"'DATOS DEPORTISTAS'!M247","v":"ANDREA HERNANDO FERRER"}]
[null,{"$f":"'DATOS DEPORTISTAS'!V248","v":"OS NABATERS D.F."},{"$f":"'DATOS DEPORTISTAS'!I248","v":"SENIOR"},{"$f":"'DATOS DEPORTISTAS'!M248","v":"JHONATHAN ESTYVEN DÍAZ TORNIÉ"}]
[null,{"$f":"'DATOS DEPORTISTAS'!V249","v":"OS NABATERS D.F."},{"$f":"'DATOS DEPORTISTAS'!I249","v":"VETERANO"},{"$f":"'DATOS DEPORTISTAS'!M249","v":"ALICIA PILAR ESTEVAN EIXARCH"}]
[null,{"$f":"'DATOS DEPORTISTAS'!V250","v":"OS NABATERS D.F."},{"$f":"'DATOS DEPORTISTAS'!I250","v":"VETERANO"},{"$f":"'DATOS DEPORTISTAS'!M250","v":"GABRIEL JOSÉ RUANO FERNÁNDEZ"}]
[null,{"$f":"'DATOS DEPORTISTAS'!V251","v":"OS NABATERS D.F."},{"$f":"'DATOS DEPORTISTAS'!I251","v":"VETERANO"},{"$f":"'DATOS DEPORTISTAS'!M251","v":"SANTIAGO LAVILLA TENÍAS"}]
[null,{"$f":"'DATOS DEPORTISTAS'!V252","v":"OS NABATERS D.F."},{"$f":"'DATOS DEPORTISTAS'!I252","v":"VETERANO"},{"$f":"'DATOS DEPORTISTAS'!M252","v":"ALICIA ROMERO DE LA ROSA"}]
[null,{"$f":"'DATOS DEPORTISTAS'!V253","v":"OS NABATERS D.F."},{"$f":"'DATOS DEPORTISTAS'!I253","v":"SENIOR"},{"$f":"'DATOS DEPORTISTAS'!M253","v":"CELIA PEÑA ROMERO DE TEJADA"}]
[null,{"$f":"'DATOS DEPORTISTAS'!V254","v":"OS NABATERS D.F."},{"$f":"'DATOS DEPORTISTAS'!I254","v":"SENIOR"},{"$f":"'DATOS DEPORTISTAS'!M254","v":"CARLOTA LAPLANA DÍAZ"}]
[null,{"$f":"'DATOS DEPORTISTAS'!V255","v":"OS NABATERS D.F."},{"$f":"'DATOS DEPORTISTAS'!I255","v":"SENIOR"},{"$f":"'DATOS DEPORTISTAS'!M255","v":"ALEJANDRO VILLACAMPA RÍOS"}]
[null,{"$f":"'DATOS DEPORTISTAS'!V256","v":"OS NABATERS D.F."},{"$f":"'DATOS DEPORTISTAS'!I256","v":"VETERANO"},{"$f":"'DATOS DEPORTISTAS'!M256","v":"JAVIER ROMEO GIL"}]
[null,{"$f":"'DATOS DEPORTISTAS'!V257","v":"OS NABATERS D.F."},{"$f":"'DATOS DEPORTISTAS'!I257","v":"SENIOR"},{"$f":"'DATOS DEPORTISTAS'!M257","v":"BORJA COSA REDONDO"}]
[null,{"$f":"'DATOS DEPORTISTAS'!V258","v":"CAPRI MEQUINENZA"},{"$f":"'DATOS DEPORTISTAS'!I258","v":"VETERANO"},{"$f":"'DATOS DEPORTISTAS'!M258","v":"ANTONIO MIGUEL VERA RUBERT"}]
[null,{"$f":"'DATOS DEPORTISTAS'!V259","v":"OS NABATERS D.F."},{"$f":"'DATOS DEPORTISTAS'!I259","v":"VETERANO"},{"$f":"'DATOS DEPORTISTAS'!M259","v":"PEDRO IGNACIO MARTÍNEZ CABELLO"}]
[null,{"$f":"'DATOS DEPORTISTAS'!V260","v":"OS NABATERS D.F."},{"$f":"'DATOS DEPORTISTAS'!I260","v":"JUVENIL"},{"$f":"'DATOS DEPORTISTAS'!M260","v":"CLAUDIA ASO LÓPEZ"}]
[null,{"$f":"'DATOS DEPORTISTAS'!V261","v":"OS NABATERS D.F."},{"$f":"'DATOS DEPORTISTAS'!I261","v":"VETERANO"},{"$f":"'DATOS DEPORTISTAS'!M261","v":"LUIS ALBERTO IBARRA"}]
[null,{"$f":"'DATOS DEPORTISTAS'!V262","v":"OS NABATERS D.F."},{"$f":"'DATOS DEPORTISTAS'!I262","v":"VETERANO"},{"$f":"'DATOS DEPORTISTAS'!M262","v":"FRANCISCO HERNÁNDEZ RODRÍGUEZ"}]
[null,{"$f":"'DATOS DEPORTISTAS'!V263","v":"CENTRO NATACION HELIOS"},{"$f":"'DATOS DEPORTISTAS'!I263","v":"INFANTIL"},{"$f":"'DATOS DEPORTISTAS'!M263","v":"MATILDE ESTRELLA RELANCIO PASTOR"}]
[null,{"$f":"'DATOS DEPORTISTAS'!V264","v":"OS NABATERS D.F."},{"$f":"'DATOS DEPORTISTAS'!I264","v":"VETERANO"},{"$f":"'DATOS DEPORTISTAS'!M264","v":"MARÍA AZUCENA FERNÁNDEZ RUIZ"}]
[null,{"$f":"'DATOS DEPORTISTAS'!V265","v":"OS NABATERS D.F."},{"$f":"'DATOS DEPORTISTAS'!I265","v":"VETERANO"},{"$f":"'DATOS DEPORTISTAS'!M265","v":"JOSÉ SALVADOR BARRERA RAMOS"}]
[null,{"$f":"'DATOS DEPORTISTAS'!V266","v":"CAPRI MEQUINENZA"},{"$f":"'DATOS DEPORTISTAS'!I266","v":"SENIOR"},{"$f":"'DATOS DEPORTISTAS'!M266","v":"KIARA VALVERDE ANDRÉS"}]
[null,{"$f":"'DATOS DEPORTISTAS'!V267","v":"CENTRO NATACION HELIOS"},{"$f":"'DATOS DEPORTISTAS'!I267","v":"VETERANO"},{"$f":"'DATOS DEPORTISTAS'!M267","v":"CARLOS MELGARES HIDALGO"}]
[null,{"$f":"'DATOS DEPORTISTAS'!V268","v":"CENTRO NATACION HELIOS"},{"$f":"'DATOS DEPORTISTAS'!I268","v":"VETERANO"},{"$f":"'DATOS DEPORTISTAS'!M268","v":"SERGIO LARROSA AZNAR"}]
[null,{"$f":"'DATOS DEPORTISTAS'!V269","v":"CENTRO NATACION HELIOS"},{"$f":"'DATOS DEPORTISTAS'!I269","v":"INFANTIL"},{"$f":"'DATOS DEPORTISTAS'!M269","v":"JOAQUÍN JESÚS SORO FUENTES"}]
[null,{"$f":"'DATOS DEPORTISTAS'!V270","v":"OS NABATERS D.F."},{"$f":"'DATOS DEPORTISTAS'!I270","v":"VETERANO"},{"$f":"'DATOS DEPORTISTAS'!M270","v":"SERGIO AURED ANTÓN"}]
[null,{"$f":"'DATOS DEPORTISTAS'!V271","v":"OS NABATERS D.F."},{"$f":"'DATOS DEPORTISTAS'!I271","v":"SENIOR"},{"$f":"'DATOS DEPORTISTAS'!M271","v":"JUAN JOSÉ MUÑOZ LAHOZ"}]
[null,{"$f":"'DATOS DEPORTISTAS'!V272","v":"OS NABATERS D.F."},{"$f":"'DATOS DEPORTISTAS'!I272","v":"SENIOR"},{"$f":"'DATOS DEPORTISTAS'!M272","v":"JUAN MUÑOZ LÓPEZ"}]
[null,{"$f":"'DATOS DEPORTISTAS'!V273","v":"OS NABATERS D.F."},{"$f":"'DATOS DEPORTISTAS'!I273","v":"SENIOR"},{"$f":"'DATOS DEPORTISTAS'!M273","v":"PEDRO OLLOQUI LÁZARO"}]
[null,{"$f":"'DATOS DEPORTISTAS'!V274","v":"CAPRI MEQUINENZA"},{"$f":"'DATOS DEPORTISTAS'!I274","v":"VETERANO"},{"$f":"'DATOS DEPORTISTAS'!M274","v":"JOSEP REINADO VIRGILI"}]
[null,{"$f":"'DATOS DEPORTISTAS'!V275","v":"CAPRI MEQUINENZA"},{"$f":"'DATOS DEPORTISTAS'!I275","v":"ALEVIN"},{"$f":"'DATOS DEPORTISTAS'!M275","v":"ALEJANDRO CANTERO ANDRÉS"}]
[null,{"$f":"'DATOS DEPORTISTAS'!V276","v":"CAPRI MEQUINENZA"},{"$f":"'DATOS DEPORTISTAS'!I276","v":"ALEVIN"},{"$f":"'DATOS DEPORTISTAS'!M276","v":"ANDREW PI MOSOVSKA"}]
[null,{"$f":"'DATOS DEPORTISTAS'!V277","v":"CAPRI MEQUINENZA"},{"$f":"'DATOS DEPORTISTAS'!I277","v":"BENJAMIN"},{"$f":"'DATOS DEPORTISTAS'!M277","v":"ALICIA LLOP RUEDA"}]
[null,{"$f":"'DATOS DEPORTISTAS'!V278","v":"CAPRI MEQUINENZA"},{"$f":"'DATOS DEPORTISTAS'!I278","v":"ALEVIN"},{"$f":"'DATOS DEPORTISTAS'!M278","v":"ERIC ROCA VENTURA"}]
[null,{"$f":"'DATOS DEPORTISTAS'!V279","v":"CAPRI MEQUINENZA"},{"$f":"'DATOS DEPORTISTAS'!I279","v":"BENJAMIN"},{"$f":"'DATOS DEPORTISTAS'!M279","v":"YUNE JUSTE IBARZ"}]
[null,{"$f":"'DATOS DEPORTISTAS'!V280","v":"CAPRI MEQUINENZA"},{"$f":"'DATOS DEPORTISTAS'!I280","v":"VETERANO"},{"$f":"'DATOS DEPORTISTAS'!M280","v":"EDUARDO ROMERA MURILLO"}]
[null,{"$f":"'DATOS DEPORTISTAS'!V281","v":"CAPRI MEQUINENZA"},{"$f":"'DATOS DEPORTISTAS'!I281","v":"VETERANO"},{"$f":"'DATOS DEPORTISTAS'!M281","v":"JUAN ANTONIO  CATALAN MULA"}]
[null,{"$f":"'DATOS DEPORTISTAS'!V282","v":"CAPRI MEQUINENZA"},{"$f":"'DATOS DEPORTISTAS'!I282","v":"VETERANO"},{"$f":"'DATOS DEPORTISTAS'!M282","v":"MERITXELL  LLOP CALLIZO"}]
[null,{"$f":"'DATOS DEPORTISTAS'!V283","v":"CAPRI MEQUINENZA"},{"$f":"'DATOS DEPORTISTAS'!I283","v":"VETERANO"},{"$f":"'DATOS DEPORTISTAS'!M283","v":"ORIOL  MIR IBARZ"}]
[null,{"$f":"'DATOS DEPORTISTAS'!V284","v":"CAPRI MEQUINENZA"},{"$f":"'DATOS DEPORTISTAS'!I284","v":"VETERANO"},{"$f":"'DATOS DEPORTISTAS'!M284","v":"DAVID TORO SOLER"}]
[null,{"$f":"'DATOS DEPORTISTAS'!V285","v":"CAPRI MEQUINENZA"},{"$f":"'DATOS DEPORTISTAS'!I285","v":"SENIOR"},{"$f":"'DATOS DEPORTISTAS'!M285","v":"JUDITH  GRAU BURRIEL"}]
[null,{"$f":"'DATOS DEPORTISTAS'!V286","v":"CAPRI MEQUINENZA"},{"$f":"'DATOS DEPORTISTAS'!I286","v":"INFANTIL"},{"$f":"'DATOS DEPORTISTAS'!M286","v":"JOKIN KOLDO ESCALONA VILLACAMPA"}]
[null,{"$f":"'DATOS DEPORTISTAS'!V287","v":"CAPRI MEQUINENZA"},{"$f":"'DATOS DEPORTISTAS'!I287","v":"VETERANO"},{"$f":"'DATOS DEPORTISTAS'!M287","v":"RUBÉN  ALDABÓ LABAILA"}]
[null,{"$f":"'DATOS DEPORTISTAS'!V288","v":"OS NABATERS"},{"$f":"'DATOS DEPORTISTAS'!I288","v":"ALEVIN"},{"$f":"'DATOS DEPORTISTAS'!M288","v":"ALICIA CABALLERO DE TORO"}]
[null,{"$f":"'DATOS DEPORTISTAS'!V289","v":"OS NABATERS"},{"$f":"'DATOS DEPORTISTAS'!I289","v":"SENIOR"},{"$f":"'DATOS DEPORTISTAS'!M289","v":"LEGA VICENTE MAGAÑA"}]
[null,{"$f":"'DATOS DEPORTISTAS'!V290","v":"OS NABATERS"},{"$f":"'DATOS DEPORTISTAS'!I290","v":"SENIOR"},{"$f":"'DATOS DEPORTISTAS'!M290","v":"ALBA LÓPEZ CORDOVILLA"}]
[null,{"$f":"'DATOS DEPORTISTAS'!V291","v":"OS NABATERS"},{"$f":"'DATOS DEPORTISTAS'!I291","v":"VETERANO"},{"$f":"'DATOS DEPORTISTAS'!M291","v":"JESÚS YUS DÍEZ"}]
[null,{"$f":"'DATOS DEPORTISTAS'!V292","v":"CAPRI MEQUINENZA"},{"$f":"'DATOS DEPORTISTAS'!I292","v":"VETERANO"},{"$f":"'DATOS DEPORTISTAS'!M292","v":"CARLOS SANJUAN SOLER"}]
[null,{"$f":"'DATOS DEPORTISTAS'!V293","v":"CAPRI MEQUINENZA"},{"$f":"'DATOS DEPORTISTAS'!I293","v":"VETERANO"},{"$f":"'DATOS DEPORTISTAS'!M293","v":"JOSÉ RAMÓN PALAU MARIMÓN"}]
[null,{"$f":"'DATOS DEPORTISTAS'!V294","v":"OS NABATERS D.F."},{"$f":"'DATOS DEPORTISTAS'!I294","v":"INFANTIL"},{"$f":"'DATOS DEPORTISTAS'!M294","v":"ALEJANDRO DUCE CASCANTE"}]
[null,{"$f":"'DATOS DEPORTISTAS'!V295","v":"OS NABATERS D.F."},{"$f":"'DATOS DEPORTISTAS'!I295","v":"BENJAMIN"},{"$f":"'DATOS DEPORTISTAS'!M295","v":"LEO HIDALGO FERNÁNDEZ"}]
[null,{"$f":"'DATOS DEPORTISTAS'!V296","v":"OS NABATERS D.F."},{"$f":"'DATOS DEPORTISTAS'!I296","v":"ALEVIN"},{"$f":"'DATOS DEPORTISTAS'!M296","v":"SIENA GIMENO BACHILLER"}]
[null,{"$f":"'DATOS DEPORTISTAS'!V297","v":"OS NABATERS D.F."},{"$f":"'DATOS DEPORTISTAS'!I297","v":"BENJAMIN"},{"$f":"'DATOS DEPORTISTAS'!M297","v":"JORGE OBENSA SIERRA"}]
[null,{"$f":"'DATOS DEPORTISTAS'!V298","v":"OS NABATERS D.F."},{"$f":"'DATOS DEPORTISTAS'!I298","v":"ALEVIN"},{"$f":"'DATOS DEPORTISTAS'!M298","v":"RUBÉN SORIA GARCÍA"}]
[null,{"$f":"'DATOS DEPORTISTAS'!V299","v":"OS NABATERS D.F."},{"$f":"'DATOS DEPORTISTAS'!I299","v":"SENIOR"},{"$f":"'DATOS DEPORTISTAS'!M299","v":"RAQUEL DE MIGUEL GRACIA"}]
[null,{"$f":"'DATOS DEPORTISTAS'!V300","v":0},{"$f":"'DATOS DEPORTISTAS'!I300","v":"BENJAMIN"},{"$f":"'DATOS DEPORTISTAS'!M300","v":0}]
[null,{"$f":"'DATOS DEPORTISTAS'!V430","v":0},{"$f":"'DATOS DEPORTISTAS'!I430","v":"VETERANO"},{"$f":"'DATOS DEPORTISTAS'!M430","v":"IRENE LÓPEZ BOSQUE"}]
[null,{"$f":"'DATOS DEPORTISTAS'!V431","v":0},{"$f":"'DATOS DEPORTISTAS'!I431","v":"VETERANO"},{"$f":"'DATOS DEPORTISTAS'!M431","v":"IRINA PUSCO VICO"}]
[null,{"$f":"'DATOS DEPORTISTAS'!V432","v":0},{"$f":"'DATOS DEPORTISTAS'!I432","v":"VETERANO"},{"$f":"'DATOS DEPORTISTAS'!M432","v":"IRVING MOISÉS CALLES CARRILLO"}]
[null,{"$f":"'DATOS DEPORTISTAS'!V433","v":0},{"$f":"'DATOS DEPORTISTAS'!I433","v":"VETERANO"},{"$f":"'DATOS DEPORTISTAS'!M433","v":"ISABEL SÁNCHEZ DENIS"}]
[null,{"$f":"'DATOS DEPORTISTAS'!V434","v":0},{"$f":"'DATOS DEPORTISTAS'!I434","v":"SENIOR"},{"$f":"'DATOS DEPORTISTAS'!M434","v":"ISMAEL  GIL MIGUEL"}]
[null,{"$f":"'DATOS DEPORTISTAS'!V435","v":0},{"$f":"'DATOS DEPORTISTAS'!I435","v":"VETERANO"},{"$f":"'DATOS DEPORTISTAS'!M435","v":"ITZIAR URQUIRI VIDAL"}]
[null,{"$f":"'DATOS DEPORTISTAS'!V436","v":0},{"$f":"'DATOS DEPORTISTAS'!I436","v":"CADETE"},{"$f":"'DATOS DEPORTISTAS'!M436","v":"IVÁN NAVARRO VILLACAMPA"}]
[null,{"$f":"'DATOS DEPORTISTAS'!V437","v":0},{"$f":"'DATOS DEPORTISTAS'!I437","v":"SENIOR"},{"$f":"'DATOS DEPORTISTAS'!M437","v":"JAIME GIMENO FERRER"}]
[null,{"$f":"'DATOS DEPORTISTAS'!V438","v":0},{"$f":"'DATOS DEPORTISTAS'!I438","v":"VETERANO"},{"$f":"'DATOS DEPORTISTAS'!M438","v":"JAIME NOGUERO CURIEL"}]
[null,{"$f":"'DATOS DEPORTISTAS'!V439","v":0},{"$f":"'DATOS DEPORTISTAS'!I439","v":"SENIOR"},{"$f":"'DATOS DEPORTISTAS'!M439","v":"JAVIER ALBERTO LOPERENA GALLEGO"}]
[null,{"$f":"'DATOS DEPORTISTAS'!V440","v":0},{"$f":"'DATOS DEPORTISTAS'!I440","v":"VETERANO"},{"$f":"'DATOS DEPORTISTAS'!M440","v":"JAVIER GARCÍA DE PABLO"}]
[null,{"$f":"'DATOS DEPORTISTAS'!V441","v":0},{"$f":"'DATOS DEPORTISTAS'!I441","v":"VETERANO"},{"$f":"'DATOS DEPORTISTAS'!M441","v":"JAVIER GARI ABELLA"}]
[null,{"$f":"'DATOS DEPORTISTAS'!V442","v":0},{"$f":"'DATOS DEPORTISTAS'!I442","v":"VETERANO"},{"$f":"'DATOS DEPORTISTAS'!M442","v":"JAVIER MELENDO SANJUAN"}]
[null,{"$f":"'DATOS DEPORTISTAS'!V443","v":0},{"$f":"'DATOS DEPORTISTAS'!I443","v":"VETERANO"},{"$f":"'DATOS DEPORTISTAS'!M443","v":"JAVIER PLAZA LEGIDO"}]
[null,{"$f":"'DATOS DEPORTISTAS'!V444","v":0},{"$f":"'DATOS DEPORTISTAS'!I444","v":"VETERANO"},{"$f":"'DATOS DEPORTISTAS'!M444","v":"JESÚS CHIPRIANA FREIRE"}]
[null,{"$f":"'DATOS DEPORTISTAS'!V445","v":0},{"$f":"'DATOS DEPORTISTAS'!I445","v":"VETERANO"},{"$f":"'DATOS DEPORTISTAS'!M445","v":"JESÚS LOGROÑO VISCASILLAS"}]
[null,{"$f":"'DATOS DEPORTISTAS'!V446","v":0},{"$f":"'DATOS DEPORTISTAS'!I446","v":"VETERANO"},{"$f":"'DATOS DEPORTISTAS'!M446","v":"JESÚS YUS DÍEZ"}]
[null,{"$f":"'DATOS DEPORTISTAS'!V447","v":0},{"$f":"'DATOS DEPORTISTAS'!I447","v":"INFANTIL"},{"$f":"'DATOS DEPORTISTAS'!M447","v":"JOKIN KOLDO ESCALONA VILLACAMPA"}]
[null,{"$f":"'DATOS DEPORTISTAS'!V448","v":0},{"$f":"'DATOS DEPORTISTAS'!I448","v":"VETERANO"},{"$f":"'DATOS DEPORTISTAS'!M448","v":"JORDI HIERRO PÁEZ"}]
[null,{"$f":"'DATOS DEPORTISTAS'!V449","v":0},{"$f":"'DATOS DEPORTISTAS'!I449","v":"CADETE"},{"$f":"'DATOS DEPORTISTAS'!M449","v":"JORDI VALLES SANJUAN"}]
[null,{"$f":"'DATOS DEPORTISTAS'!V450","v":0},{"$f":"'DATOS DEPORTISTAS'!V450","v":0},{"$f":"'DATOS DEPORTISTAS'!M450","v":"JORGE CALAVIA VALDOVINOS"}]
[null,{"$f":"'DATOS DEPORTISTAS'!V451","v":0},{"$f":"'DATOS DEPORTISTAS'!I451","v":"CADETE"},{"$f":"'DATOS DEPORTISTAS'!M451","v":"JORGE FRANCÉS VINTANED"}]
[null,{"$f":"'DATOS DEPORTISTAS'!V452","v":0},{"$f":"'DATOS DEPORTISTAS'!I452","v":"SENIOR"},{"$f":"'DATOS DEPORTISTAS'!M452","v":"JORGE LITE BARÓN"}]
[null,{"$f":"'DATOS DEPORTISTAS'!V453","v":0},{"$f":"'DATOS DEPORTISTAS'!I453","v":"SENIOR"},{"$f":"'DATOS DEPORTISTAS'!M453","v":"JORGE PEQUERUL SARIÑENA"}]
[null,{"$f":"'DATOS DEPORTISTAS'!V454","v":0},{"$f":"'DATOS DEPORTISTAS'!I454","v":"SENIOR"},{"$f":"'DATOS DEPORTISTAS'!M454","v":"JORGE SEBASTIÁN NUEZ"}]
[null,{"$f":"'DATOS DEPORTISTAS'!V455","v":0},{"$f":"'DATOS DEPORTISTAS'!I455","v":"VETERANO"},{"$f":"'DATOS DEPORTISTAS'!M455","v":"JOSÉ ANTONIO VILELLA RIAU"}]
[null,{"$f":"'DATOS DEPORTISTAS'!V456","v":0},{"$f":"'DATOS DEPORTISTAS'!I456","v":"VETERANO"},{"$f":"'DATOS DEPORTISTAS'!M456","v":"JOSÉ CARLOS VICENTE ESCOSA"}]
[null,{"$f":"'DATOS DEPORTISTAS'!V457","v":0},{"$f":"'DATOS DEPORTISTAS'!I457","v":"VETERANO"},{"$f":"'DATOS DEPORTISTAS'!M457","v":"JOSÉ CARMELO RICO"}]
[null,{"$f":"'DATOS DEPORTISTAS'!V458","v":0},{"$f":"'DATOS DEPORTISTAS'!I458","v":"VETERANO"},{"$f":"'DATOS DEPORTISTAS'!M458","v":"JOSÉ CARMELO RICO MORENO"}]
[null,{"$f":"'DATOS DEPORTISTAS'!V459","v":0},{"$f":"'DATOS DEPORTISTAS'!I459","v":"VETERANO"},{"$f":"'DATOS DEPORTISTAS'!M459","v":"JOSÉ GODIA VIVES"}]
[null,{"$f":"'DATOS DEPORTISTAS'!V460","v":0},{"$f":"'DATOS DEPORTISTAS'!I460","v":"VETERANO"},{"$f":"'DATOS DEPORTISTAS'!M460","v":"JOSÉ IGNACIO CALVENTE VELLOSO"}]
[null,{"$f":"'DATOS DEPORTISTAS'!V461","v":0},{"$f":"'DATOS DEPORTISTAS'!I461","v":"SENIOR"},{"$f":"'DATOS DEPORTISTAS'!M461","v":"JOSÉ IGNACIO DUESO BELVER"}]
[null,{"$f":"'DATOS DEPORTISTAS'!V462","v":0},{"$f":"'DATOS DEPORTISTAS'!I462","v":"SENIOR"},{"$f":"'DATOS DEPORTISTAS'!M462","v":"JOSÉ IGNACIO SANTA EUGENIA MERCADO"}]
[null,{"$f":"'DATOS DEPORTISTAS'!V463","v":0},{"$f":"'DATOS DEPORTISTAS'!I463","v":"JUVENIL"},{"$f":"'DATOS DEPORTISTAS'!M463","v":"JOSÉ JAVIER LEAL SUÁREZ"}]
[null,{"$f":"'DATOS DEPORTISTAS'!V464","v":0},{"$f":"'DATOS DEPORTISTAS'!I464","v":"SENIOR"},{"$f":"'DATOS DEPORTISTAS'!M464","v":"JOSÉ LARIO MARÍN"}]
[null,{"$f":"'DATOS DEPORTISTAS'!V465","v":0},{"$f":"'DATOS DEPORTISTAS'!I465","v":"VETERANO"},{"$f":"'DATOS DEPORTISTAS'!M465","v":"JOSÉ MANUEL CERDÁN TORCAL"}]
[null,{"$f":"'DATOS DEPORTISTAS'!V466","v":0},{"$f":"'DATOS DEPORTISTAS'!I466","v":"VETERANO"},{"$f":"'DATOS DEPORTISTAS'!M466","v":"JOSÉ MANUEL IBARZ IBARZ"}]
[null,{"$f":"'DATOS DEPORTISTAS'!V467","v":0},{"$f":"'DATOS DEPORTISTAS'!I467","v":"VETERANO"},{"$f":"'DATOS DEPORTISTAS'!M467","v":"JOSÉ MARÍA RAMÓN COSIALS"}]
[null,{"$f":"'DATOS DEPORTISTAS'!V468","v":0},{"$f":"'DATOS DEPORTISTAS'!I468","v":"VETERANO"},{"$f":"'DATOS DEPORTISTAS'!M468","v":"JOSÉ PASTOR ASENSIO"}]
[null,{"$f":"'DATOS DEPORTISTAS'!V469","v":0},{"$f":"'DATOS DEPORTISTAS'!I469","v":"CADETE"},{"$f":"'DATOS DEPORTISTAS'!M469","v":"JOSÉ PIÑEDO TORRES"}]
[null,{"$f":"'DATOS DEPORTISTAS'!V470","v":0},{"$f":"'DATOS DEPORTISTAS'!I470","v":"VETERANO"},{"$f":"'DATOS DEPORTISTAS'!M470","v":"JOXEMIEL URRA LAMANA"}]
[null,{"$f":"'DATOS DEPORTISTAS'!V471","v":0},{"$f":"'DATOS DEPORTISTAS'!I471","v":"SENIOR"},{"$f":"'DATOS DEPORTISTAS'!M471","v":"JUAN JOSÉ MUÑOZ LAHOZ"}]
[null,{"$f":"'DATOS DEPORTISTAS'!V472","v":0},{"$f":"'DATOS DEPORTISTAS'!I472","v":"SENIOR"},{"$f":"'DATOS DEPORTISTAS'!M472","v":"JUAN MUÑOZ LÓPEZ"}]
[null,{"$f":"'DATOS DEPORTISTAS'!V473","v":0},{"$f":"'DATOS DEPORTISTAS'!I473","v":"VETERANO"},{"$f":"'DATOS DEPORTISTAS'!M473","v":"JUAN RAMÓN NIETO SÁNCHEZ"}]
[null,{"$f":"'DATOS DEPORTISTAS'!V474","v":0},{"$f":"'DATOS DEPORTISTAS'!V474","v":0},{"$f":"'DATOS DEPORTISTAS'!M474","v":"JUDITH LONCÁ RIAU"}]
[null,{"$f":"'DATOS DEPORTISTAS'!V475","v":0},{"$f":"'DATOS DEPORTISTAS'!I475","v":"VETERANO"},{"$f":"'DATOS DEPORTISTAS'!M475","v":"JUDITH MURILLO AGUILAR"}]
[null,{"$f":"'DATOS DEPORTISTAS'!V476","v":0},{"$f":"'DATOS DEPORTISTAS'!V476","v":0},{"$f":"'DATOS DEPORTISTAS'!M476","v":"JULIA MODREGO CANTORNA"}]
[null,{"$f":"'DATOS DEPORTISTAS'!V477","v":0},{"$f":"'DATOS DEPORTISTAS'!I477","v":"JUVENIL"},{"$f":"'DATOS DEPORTISTAS'!M477","v":"JULIA PIÑEDO TORRES"}]
[null,{"$f":"'DATOS DEPORTISTAS'!V478","v":0},{"$f":"'DATOS DEPORTISTAS'!I478","v":"SENIOR"},{"$f":"'DATOS DEPORTISTAS'!M478","v":"JUNCAL GÓMEZ RIVERO"}]
[null,{"$f":"'DATOS DEPORTISTAS'!V479","v":0},{"$f":"'DATOS DEPORTISTAS'!I479","v":"INFANTIL"},{"$f":"'DATOS DEPORTISTAS'!M479","v":"KARIM GARCIA BECHDJ"}]
[null,{"$f":"'DATOS DEPORTISTAS'!V480","v":0},{"$f":"'DATOS DEPORTISTAS'!I480","v":"JUVENIL"},{"$f":"'DATOS DEPORTISTAS'!M480","v":"KATHRYN ELIZABETH EPPERSON"}]
[null,{"$f":"'DATOS DEPORTISTAS'!V481","v":0},{"$f":"'DATOS DEPORTISTAS'!I481","v":"JUVENIL"},{"$f":"'DATOS DEPORTISTAS'!M481","v":"KHALID CHALHI"}]
[null,{"$f":"'DATOS DEPORTISTAS'!V482","v":0},{"$f":"'DATOS DEPORTISTAS'!I482","v":"SENIOR"},{"$f":"'DATOS DEPORTISTAS'!M482","v":"KIARA GRACIA ALUTIZ"}]
[null,{"$f":"'DATOS DEPORTISTAS'!V483","v":0},{"$f":"'DATOS DEPORTISTAS'!I483","v":"SENIOR"},{"$f":"'DATOS DEPORTISTAS'!M483","v":"KIARA VALVERDE ANDRÉS"}]
[null,{"$f":"'DATOS DEPORTISTAS'!V484","v":0},{"$f":"'DATOS DEPORTISTAS'!I484","v":"SENIOR"},{"$f":"'DATOS DEPORTISTAS'!M484","v":"LARA MARGUERITE DEMANDE"}]
[null,{"$f":"'DATOS DEPORTISTAS'!V485","v":0},{"$f":"'DATOS DEPORTISTAS'!I485","v":"ALEVIN"},{"$f":"'DATOS DEPORTISTAS'!M485","v":"LAURA ALONSO VIADER"}]
[null,{"$f":"'DATOS DEPORTISTAS'!V486","v":0},{"$f":"'DATOS DEPORTISTAS'!I486","v":"VETERANO"},{"$f":"'DATOS DEPORTISTAS'!M486","v":"LAURA FERNÁNDEZ GRASA"}]
[null,{"$f":"'DATOS DEPORTISTAS'!V487","v":0},{"$f":"'DATOS DEPORTISTAS'!I487","v":"VETERANO"},{"$f":"'DATOS DEPORTISTAS'!M487","v":"LAURA FORNOS NAVARRO"}]
[null,{"$f":"'DATOS DEPORTISTAS'!V488","v":0},{"$f":"'DATOS DEPORTISTAS'!I488","v":"JUVENIL"},{"$f":"'DATOS DEPORTISTAS'!M488","v":"LAURA JAVIERRE LÓPEZ"}]
[null,{"$f":"'DATOS DEPORTISTAS'!V489","v":0},{"$f":"'DATOS DEPORTISTAS'!I489","v":"SENIOR"},{"$f":"'DATOS DEPORTISTAS'!M489","v":"LEIRE PÉREZ DE ACHA"}]
[null,{"$f":"'DATOS DEPORTISTAS'!V490","v":0},{"$f":"'DATOS DEPORTISTAS'!I490","v":"JUVENIL"},{"$f":"'DATOS DEPORTISTAS'!M490","v":"LEO TSAI BADENHOPE"}]
[null,{"$f":"'DATOS DEPORTISTAS'!V491","v":0},{"$f":"'DATOS DEPORTISTAS'!I491","v":"INFANTIL"},{"$f":"'DATOS DEPORTISTAS'!M491","v":"LEÓN NEBRA MARTÍNEZ"}]
[null,{"$f":"'DATOS DEPORTISTAS'!V492","v":0},{"$f":"'DATOS DEPORTISTAS'!I492","v":"SENIOR"},{"$f":"'DATOS DEPORTISTAS'!M492","v":"LEYRE LEGAZ LAFUENTE"}]
[null,{"$f":"'DATOS DEPORTISTAS'!V493","v":0},{"$f":"'DATOS DEPORTISTAS'!I493","v":"JUVENIL"},{"$f":"'DATOS DEPORTISTAS'!M493","v":"LIZANDRO DÍAZ TORNOE"}]
[null,{"$f":"'DATOS DEPORTISTAS'!V494","v":0},{"$f":"'DATOS DEPORTISTAS'!I494","v":"INFANTIL"},{"$f":"'DATOS DEPORTISTAS'!M494","v":"LLUC ESTRADA ROLDÁN"}]
[null,{"$f":"'DATOS DEPORTISTAS'!V495","v":0},{"$f":"'DATOS DEPORTISTAS'!I495","v":"VETERANO"},{"$f":"'DATOS DEPORTISTAS'!M495","v":"LUCAS ANDRÉS RODRÍGUEZ"}]
[null,{"$f":"'DATOS DEPORTISTAS'!V496","v":0},{"$f":"'DATOS DEPORTISTAS'!I496","v":"SENIOR"},{"$f":"'DATOS DEPORTISTAS'!M496","v":"LUCAS FERRANDO QUÍLEZ"}]
[null,{"$f":"'DATOS DEPORTISTAS'!V497","v":0},{"$f":"'DATOS DEPORTISTAS'!I497","v":"SENIOR"},{"$f":"'DATOS DEPORTISTAS'!M497","v":"LUCAS MONTI SCHERZER"}]
[null,{"$f":"'DATOS DEPORTISTAS'!V498","v":0},{"$f":"'DATOS DEPORTISTAS'!I498","v":"SENIOR"},{"$f":"'DATOS DEPORTISTAS'!M498","v":"LUCÍA BOLEA PALOMAR"}]
[null,{"$f":"'DATOS DEPORTISTAS'!V499","v":0},{"$f":"'DATOS DEPORTISTAS'!I499","v":"SENIOR"},{"$f":"'DATOS DEPORTISTAS'!M499","v":"LUCÍA DE LA LASTRA LANZA"}]
[null,{"$f":"'DATOS DEPORTISTAS'!V500","v":0},{"$f":"'DATOS DEPORTISTAS'!I500","v":"SENIOR"},{"$f":"'DATOS DEPORTISTAS'!M500","v":"LUCÍA JÚDEZ PÉREZ"}]
[null,{"$f":"'DATOS DEPORTISTAS'!V501","v":0},{"$f":"'DATOS DEPORTISTAS'!I501","v":"JUVENIL"},{"$f":"'DATOS DEPORTISTAS'!M501","v":"LUCÍA MÁRQUEZ GUARDIOLA"}]
[null,{"$f":"'DATOS DEPORTISTAS'!V502","v":0},{"$f":"'DATOS DEPORTISTAS'!I502","v":"VETERANO"},{"$f":"'DATOS DEPORTISTAS'!M502","v":"LUIS JAVIER ROCA OLIVER"}]
[null,{"$f":"'DATOS DEPORTISTAS'!V503","v":0},{"$f":"'DATOS DEPORTISTAS'!I503","v":"BENJAMIN"},{"$f":"'DATOS DEPORTISTAS'!M503","v":"LUJÁN ARBIOL FORNOS"}]
[null,{"$f":"'DATOS DEPORTISTAS'!V504","v":0},{"$f":"'DATOS DEPORTISTAS'!I504","v":"CADETE"},{"$f":"'DATOS DEPORTISTAS'!M504","v":"MAELYA  EHRET GARCÍA"}]
[null,{"$f":"'DATOS DEPORTISTAS'!V505","v":0},{"$f":"'DATOS DEPORTISTAS'!I505","v":"SENIOR"},{"$f":"'DATOS DEPORTISTAS'!M505","v":"MANUEL BERNAL LECINA"}]
[null,{"$f":"'DATOS DEPORTISTAS'!V506","v":0},{"$f":"'DATOS DEPORTISTAS'!I506","v":"SENIOR"},{"$f":"'DATOS DEPORTISTAS'!M506","v":"MANUEL CALVO BOLSA"}]
[null,{"$f":"'DATOS DEPORTISTAS'!V507","v":0},{"$f":"'DATOS DEPORTISTAS'!I507","v":"CADETE"},{"$f":"'DATOS DEPORTISTAS'!M507","v":"MARA NOVIALS OLIVER"}]
[null,{"$f":"'DATOS DEPORTISTAS'!V508","v":0},{"$f":"'DATOS DEPORTISTAS'!I508","v":"ALEVIN"},{"$f":"'DATOS DEPORTISTAS'!M508","v":"MARC OLIVER IBARZ"}]
[null,{"$f":"'DATOS DEPORTISTAS'!V509","v":0},{"$f":"'DATOS DEPORTISTAS'!I509","v":"CADETE"},{"$f":"'DATOS DEPORTISTAS'!M509","v":"MARCOS LÁZARO SANTABÁRBARA"}]
[null,{"$f":"'DATOS DEPORTISTAS'!V510","v":0},{"$f":"'DATOS DEPORTISTAS'!I510","v":"INFANTIL"},{"$f":"'DATOS DEPORTISTAS'!M510","v":"MARCOS LUNA IBARZ"}]
[null,{"$f":"'DATOS DEPORTISTAS'!V511","v":0},{"$f":"'DATOS DEPORTISTAS'!I511","v":"SENIOR"},{"$f":"'DATOS DEPORTISTAS'!M511","v":"MARCOS MARTÍNEZ IBÁÑEZ"}]
[null,{"$f":"'DATOS DEPORTISTAS'!V512","v":0},{"$f":"'DATOS DEPORTISTAS'!I512","v":"SENIOR"},{"$f":"'DATOS DEPORTISTAS'!M512","v":"MARÍA AGUD MONTAÑES"}]
[null,{"$f":"'DATOS DEPORTISTAS'!V513","v":0},{"$f":"'DATOS DEPORTISTAS'!I513","v":"SENIOR"},{"$f":"'DATOS DEPORTISTAS'!M513","v":"MARÍA ALGUERÓ NADAL"}]
[null,{"$f":"'DATOS DEPORTISTAS'!V514","v":0},{"$f":"'DATOS DEPORTISTAS'!I514","v":"SENIOR"},{"$f":"'DATOS DEPORTISTAS'!M514","v":"MARÍA ALONSO GUTIÉRREZ"}]
[null,{"$f":"'DATOS DEPORTISTAS'!V515","v":0},{"$f":"'DATOS DEPORTISTAS'!I515","v":"VETERANO"},{"$f":"'DATOS DEPORTISTAS'!M515","v":"MARÍA CRISTINA GÓMEZ DE MENA"}]
[null,{"$f":"'DATOS DEPORTISTAS'!V516","v":0},{"$f":"'DATOS DEPORTISTAS'!I516","v":"SENIOR"},{"$f":"'DATOS DEPORTISTAS'!M516","v":"MARÍA DUESO BELVER"}]
[null,{"$f":"'DATOS DEPORTISTAS'!V517","v":0},{"$f":"'DATOS DEPORTISTAS'!I517","v":"VETERANO"},{"$f":"'DATOS DEPORTISTAS'!M517","v":"MARÍA INÉS RIVERO MINNERY"}]
[null,{"$f":"'DATOS DEPORTISTAS'!V518","v":0},{"$f":"'DATOS DEPORTISTAS'!I518","v":"VETERANO"},{"$f":"'DATOS DEPORTISTAS'!M518","v":"MARÍA INMACULADA MUNIESA NAVARRO"}]
[null,{"$f":"'DATOS DEPORTISTAS'!V519","v":0},{"$f":"'DATOS DEPORTISTAS'!I519","v":"VETERANO"},{"$f":"'DATOS DEPORTISTAS'!M519","v":"MARÍA ISABEL BLASCO OLIETE"}]
[null,{"$f":"'DATOS DEPORTISTAS'!V520","v":0},{"$f":"'DATOS DEPORTISTAS'!I520","v":"VETERANO"},{"$f":"'DATOS DEPORTISTAS'!M520","v":"MARÍA ISABEL TOLOSANA ARBONES"}]
[null,{"$f":"'DATOS DEPORTISTAS'!V521","v":0},{"$f":"'DATOS DEPORTISTAS'!I521","v":"VETERANO"},{"$f":"'DATOS DEPORTISTAS'!M521","v":"MARÍA JESÚS GONZALVO ITURRIAGA"}]
[null,{"$f":"'DATOS DEPORTISTAS'!V522","v":0},{"$f":"'DATOS DEPORTISTAS'!I522","v":"VETERANO"},{"$f":"'DATOS DEPORTISTAS'!M522","v":"MARÍA JOSÉ PÉREZ MALLÉN"}]
[null,{"$f":"'DATOS DEPORTISTAS'!V523","v":0},{"$f":"'DATOS DEPORTISTAS'!I523","v":"VETERANO"},{"$f":"'DATOS DEPORTISTAS'!M523","v":"MARÍA LOURDES RODRÍGUEZ BRAÑA"}]
[null,{"$f":"'DATOS DEPORTISTAS'!V524","v":0},{"$f":"'DATOS DEPORTISTAS'!I524","v":"VETERANO"},{"$f":"'DATOS DEPORTISTAS'!M524","v":"MARÍA PILAR USED LAHOZ"}]
[null,{"$f":"'DATOS DEPORTISTAS'!V525","v":0},{"$f":"'DATOS DEPORTISTAS'!I525","v":"VETERANO"},{"$f":"'DATOS DEPORTISTAS'!M525","v":"MARÍA TERESA GRAU JALLE"}]
[null,{"$f":"'DATOS DEPORTISTAS'!V526","v":0},{"$f":"'DATOS DEPORTISTAS'!I526","v":"SENIOR"},{"$f":"'DATOS DEPORTISTAS'!M526","v":"MARIAN-MADALIN MIHAI"}]
[null,{"$f":"'DATOS DEPORTISTAS'!V527","v":0},{"$f":"'DATOS DEPORTISTAS'!I527","v":"SENIOR"},{"$f":"'DATOS DEPORTISTAS'!M527","v":"MARINA MARTÍNEZ FERNÁNDEZ"}]
[null,{"$f":"'DATOS DEPORTISTAS'!V528","v":0},{"$f":"'DATOS DEPORTISTAS'!I528","v":"SENIOR"},{"$f":"'DATOS DEPORTISTAS'!M528","v":"MARINO OLIVEROS BLANCO"}]
[null,{"$f":"'DATOS DEPORTISTAS'!V529","v":0},{"$f":"'DATOS DEPORTISTAS'!I529","v":"CADETE"},{"$f":"'DATOS DEPORTISTAS'!M529","v":"MARKEL OTEGUI SANTOLARIA"}]
[null,{"$f":"'DATOS DEPORTISTAS'!V530","v":0},{"$f":"'DATOS DEPORTISTAS'!I530","v":"VETERANO"},{"$f":"'DATOS DEPORTISTAS'!M530","v":"MARTA  GAYA JORNET"}]
[null,{"$f":"'DATOS DEPORTISTAS'!V531","v":0},{"$f":"'DATOS DEPORTISTAS'!I531","v":"VETERANO"},{"$f":"'DATOS DEPORTISTAS'!M531","v":"MARTA FERNANDA ESCALONA COLOMÉ"}]
[null,{"$f":"'DATOS DEPORTISTAS'!V532","v":0},{"$f":"'DATOS DEPORTISTAS'!I532","v":"JUVENIL"},{"$f":"'DATOS DEPORTISTAS'!M532","v":"MARTA LARIO MARTÍNEZ"}]
[null,{"$f":"'DATOS DEPORTISTAS'!V533","v":0},{"$f":"'DATOS DEPORTISTAS'!I533","v":"JUVENIL"},{"$f":"'DATOS DEPORTISTAS'!M533","v":"MARTÍN BOLEA PALOMAR"}]
[null,{"$f":"'DATOS DEPORTISTAS'!V534","v":0},{"$f":"'DATOS DEPORTISTAS'!I534","v":"INFANTIL"},{"$f":"'DATOS DEPORTISTAS'!M534","v":"MARTINA ESTEVE NEVADO"}]
[null,{"$f":"'DATOS DEPORTISTAS'!V535","v":0},{"$f":"'DATOS DEPORTISTAS'!I535","v":"ALEVIN"},{"$f":"'DATOS DEPORTISTAS'!M535","v":"MARTINA VELILLA PÉREZ"}]
[null,{"$f":"'DATOS DEPORTISTAS'!V536","v":0},{"$f":"'DATOS DEPORTISTAS'!I536","v":"VETERANO"},{"$f":"'DATOS DEPORTISTAS'!M536","v":"MERITXELL LLOP CALLIZO"}]
[null,{"$f":"'DATOS DEPORTISTAS'!V537","v":0},{"$f":"'DATOS DEPORTISTAS'!I537","v":"VETERANO"},{"$f":"'DATOS DEPORTISTAS'!M537","v":"MERITXELL SIMÓN MARTÍN"}]
[null,{"$f":"'DATOS DEPORTISTAS'!V538","v":0},{"$f":"'DATOS DEPORTISTAS'!I538","v":"JUVENIL"},{"$f":"'DATOS DEPORTISTAS'!M538","v":"MIGUEL ABENIA CÁMARA"}]
[null,{"$f":"'DATOS DEPORTISTAS'!V539","v":0},{"$f":"'DATOS DEPORTISTAS'!I539","v":"VETERANO"},{"$f":"'DATOS DEPORTISTAS'!M539","v":"MIGUEL AJA BARQUÍN"}]
[null,{"$f":"'DATOS DEPORTISTAS'!V540","v":0},{"$f":"'DATOS DEPORTISTAS'!I540","v":"SENIOR"},{"$f":"'DATOS DEPORTISTAS'!M540","v":"MIGUEL BIEL CAMAÑES"}]
[null,{"$f":"'DATOS DEPORTISTAS'!V541","v":0},{"$f":"'DATOS DEPORTISTAS'!I541","v":"SENIOR"},{"$f":"'DATOS DEPORTISTAS'!M541","v":"MIGUEL CORZÁN LÓPEZ"}]
[null,{"$f":"'DATOS DEPORTISTAS'!V542","v":0},{"$f":"'DATOS DEPORTISTAS'!I542","v":"VETERANO"},{"$f":"'DATOS DEPORTISTAS'!M542","v":"MÓNICA BERENGUER CÉSPEDES"}]
[null,{"$f":"'DATOS DEPORTISTAS'!V543","v":0},{"$f":"'DATOS DEPORTISTAS'!I543","v":"VETERANO"},{"$f":"'DATOS DEPORTISTAS'!M543","v":"MONTSERRAT CRESPO SETIÉN"}]
[null,{"$f":"'DATOS DEPORTISTAS'!V544","v":0},{"$f":"'DATOS DEPORTISTAS'!I544","v":"SENIOR"},{"$f":"'DATOS DEPORTISTAS'!M544","v":"MONTSERRAT PALAU LARA"}]
[null,{"$f":"'DATOS DEPORTISTAS'!V545","v":0},{"$f":"'DATOS DEPORTISTAS'!I545","v":"ALEVIN"},{"$f":"'DATOS DEPORTISTAS'!M545","v":"NAIA GUARDIOLA BARTOLOMÉ"}]
[null,{"$f":"'DATOS DEPORTISTAS'!V546","v":0},{"$f":"'DATOS DEPORTISTAS'!I546","v":"VETERANO"},{"$f":"'DATOS DEPORTISTAS'!M546","v":"NAJAT NOUALI EL GUENNOUNI"}]
[null,{"$f":"'DATOS DEPORTISTAS'!V547","v":0},{"$f":"'DATOS DEPORTISTAS'!I547","v":"SENIOR"},{"$f":"'DATOS DEPORTISTAS'!M547","v":"NATALIA SERRANO GUALLAR"}]
[null,{"$f":"'DATOS DEPORTISTAS'!V548","v":0},{"$f":"'DATOS DEPORTISTAS'!I548","v":"JUVENIL"},{"$f":"'DATOS DEPORTISTAS'!M548","v":"NICOL KOGUT"}]
[null,{"$f":"'DATOS DEPORTISTAS'!V549","v":0},{"$f":"'DATOS DEPORTISTAS'!I549","v":"JUVENIL"},{"$f":"'DATOS DEPORTISTAS'!M549","v":"NICOLÁS FAURE MARTÍN"}]
[null,{"$f":"'DATOS DEPORTISTAS'!V550","v":0},{"$f":"'DATOS DEPORTISTAS'!I550","v":"VETERANO"},{"$f":"'DATOS DEPORTISTAS'!M550","v":"NICOLÁS GONZÁLEZ FERNÁNCEZ"}]
[null,{"$f":"'DATOS DEPORTISTAS'!V551","v":0},{"$f":"'DATOS DEPORTISTAS'!I551","v":"ALEVIN"},{"$f":"'DATOS DEPORTISTAS'!M551","v":"NOA PALAU FERRAGUT"}]
[null,{"$f":"'DATOS DEPORTISTAS'!V552","v":0},{"$f":"'DATOS DEPORTISTAS'!I552","v":"VETERANO"},{"$f":"'DATOS DEPORTISTAS'!M552","v":"NOELIA ARA GRACIA"}]
[null,{"$f":"'DATOS DEPORTISTAS'!V553","v":0},{"$f":"'DATOS DEPORTISTAS'!I553","v":"SENIOR"},{"$f":"'DATOS DEPORTISTAS'!M553","v":"ÓSCAR MARTÍN TORRES"}]
[null,{"$f":"'DATOS DEPORTISTAS'!V554","v":0},{"$f":"'DATOS DEPORTISTAS'!I554","v":"SENIOR"},{"$f":"'DATOS DEPORTISTAS'!M554","v":"PABLO ALONSO RAMOS"}]
[null,{"$f":"'DATOS DEPORTISTAS'!V555","v":0},{"$f":"'DATOS DEPORTISTAS'!I555","v":"SENIOR"},{"$f":"'DATOS DEPORTISTAS'!M555","v":"PABLO JURADO PÉREZ"}]
[null,{"$f":"'DATOS DEPORTISTAS'!V556","v":0},{"$f":"'DATOS DEPORTISTAS'!I556","v":"VETERANO"},{"$f":"'DATOS DEPORTISTAS'!M556","v":"PABLO SERRANO MARTÍNEZ"}]
[null,{"$f":"'DATOS DEPORTISTAS'!V557","v":0},{"$f":"'DATOS DEPORTISTAS'!I557","v":"SENIOR"},{"$f":"'DATOS DEPORTISTAS'!M557","v":"PABLO VAL CAMPILLO"}]
[null,{"$f":"'DATOS DEPORTISTAS'!V558","v":0},{"$f":"'DATOS DEPORTISTAS'!I558","v":"VETERANO"},{"$f":"'DATOS DEPORTISTAS'!M558","v":"PALOMA GIMENO RIAU"}]
[null,{"$f":"'DATOS DEPORTISTAS'!V559","v":0},{"$f":"'DATOS DEPORTISTAS'!I559","v":"VETERANO"},{"$f":"'DATOS DEPORTISTAS'!M559","v":"PAOLA MOLINA ALONSO"}]
[null,{"$f":"'DATOS DEPORTISTAS'!V560","v":0},{"$f":"'DATOS DEPORTISTAS'!I560","v":"SENIOR"},{"$f":"'DATOS DEPORTISTAS'!M560","v":"PATRICIA BARAT CORTÉS"}]
[null,{"$f":"'DATOS DEPORTISTAS'!V561","v":0},{"$f":"'DATOS DEPORTISTAS'!I561","v":"VETERANO"},{"$f":"'DATOS DEPORTISTAS'!M561","v":"PATRICIA BETRIÁN HERRERA"}]
[null,{"$f":"'DATOS DEPORTISTAS'!V562","v":0},{"$f":"'DATOS DEPORTISTAS'!I562","v":"VETERANO"},{"$f":"'DATOS DEPORTISTAS'!M562","v":"PATRICIA MOLINA McGHEE"}]
[null,{"$f":"'DATOS DEPORTISTAS'!V563","v":0},{"$f":"'DATOS DEPORTISTAS'!I563","v":"JUVENIL"},{"$f":"'DATOS DEPORTISTAS'!M563","v":"PATRICIA MUÑOZ OCHOA"}]
[null,{"$f":"'DATOS DEPORTISTAS'!V564","v":0},{"$f":"'DATOS DEPORTISTAS'!I564","v":"JUVENIL"},{"$f":"'DATOS DEPORTISTAS'!M564","v":"PATRICIA MURIAGO PÉREZ-LIZANU"}]
[null,{"$f":"'DATOS DEPORTISTAS'!V565","v":0},{"$f":"'DATOS DEPORTISTAS'!I565","v":"VETERANO"},{"$f":"'DATOS DEPORTISTAS'!M565","v":"PAÚL INEVA SALILLAS"}]
[null,{"$f":"'DATOS DEPORTISTAS'!V566","v":0},{"$f":"'DATOS DEPORTISTAS'!I566","v":"SENIOR"},{"$f":"'DATOS DEPORTISTAS'!M566","v":"PAULA FALCÓ FLETA"}]
[null,{"$f":"'DATOS DEPORTISTAS'!V567","v":0},{"$f":"'DATOS DEPORTISTAS'!I567","v":"INFANTIL"},{"$f":"'DATOS DEPORTISTAS'!M567","v":"PAULA GÓMEZ CARMONA"}]
[null,{"$f":"'DATOS DEPORTISTAS'!V568","v":0},{"$f":"'DATOS DEPORTISTAS'!I568","v":"SENIOR"},{"$f":"'DATOS DEPORTISTAS'!M568","v":"PAULA LORDA BESTUÉ"}]
[null,{"$f":"'DATOS DEPORTISTAS'!V569","v":0},{"$f":"'DATOS DEPORTISTAS'!I569","v":"SENIOR"},{"$f":"'DATOS DEPORTISTAS'!M569","v":"PAULA MARÍA ARNILLAS IBARZ"}]
[null,{"$f":"'DATOS DEPORTISTAS'!V570","v":0},{"$f":"'DATOS DEPORTISTAS'!I570","v":"SENIOR"},{"$f":"'DATOS DEPORTISTAS'!M570","v":"PAULA MARÍA ARNILLAS IBARZ"}]
[null,{"$f":"'DATOS DEPORTISTAS'!V571","v":0},{"$f":"'DATOS DEPORTISTAS'!I571","v":"VETERANO"},{"$f":"'DATOS DEPORTISTAS'!M571","v":"PAULA RODRÍGUEZ CAMBRA"}]
[null,{"$f":"'DATOS DEPORTISTAS'!V572","v":0},{"$f":"'DATOS DEPORTISTAS'!I572","v":"JUVENIL"},{"$f":"'DATOS DEPORTISTAS'!M572","v":"PAULA VERA JARQUE"}]
[null,{"$f":"'DATOS DEPORTISTAS'!V573","v":0},{"$f":"'DATOS DEPORTISTAS'!I573","v":"SENIOR"},{"$f":"'DATOS DEPORTISTAS'!M573","v":"PEDRO ALEJANDRO LORENZ CALVO"}]
[null,{"$f":"'DATOS DEPORTISTAS'!V574","v":0},{"$f":"'DATOS DEPORTISTAS'!I574","v":"VETERANO"},{"$f":"'DATOS DEPORTISTAS'!M574","v":"PEDRO IGNACIO MARTÍNEZ CABELLO"}]
[null,{"$f":"'DATOS DEPORTISTAS'!V575","v":0},{"$f":"'DATOS DEPORTISTAS'!I575","v":"SENIOR"},{"$f":"'DATOS DEPORTISTAS'!M575","v":"PEDRO OLLOQUI LÁZARO"}]
[null,{"$f":"'DATOS DEPORTISTAS'!V576","v":0},{"$f":"'DATOS DEPORTISTAS'!I576","v":"VETERANO"},{"$f":"'DATOS DEPORTISTAS'!M576","v":"PEDRO VILLAR MARTÍNEZ"}]
[null,{"$f":"'DATOS DEPORTISTAS'!V577","v":0},{"$f":"'DATOS DEPORTISTAS'!I577","v":"SENIOR"},{"$f":"'DATOS DEPORTISTAS'!M577","v":"RAÚL ÁNGEL CORTÉS MORENO"}]
[null,{"$f":"'DATOS DEPORTISTAS'!V578","v":0},{"$f":"'DATOS DEPORTISTAS'!I578","v":"VETERANO"},{"$f":"'DATOS DEPORTISTAS'!M578","v":"RAÚL NOGUERAS PUEYO"}]
[null,{"$f":"'DATOS DEPORTISTAS'!V579","v":0},{"$f":"'DATOS DEPORTISTAS'!I579","v":"CADETE"},{"$f":"'DATOS DEPORTISTAS'!M579","v":"REBECA ASO LÓPEZ"}]
[null,{"$f":"'DATOS DEPORTISTAS'!V580","v":"C. DE REMO RETIRO 66"},{"$f":"'DATOS DEPORTISTAS'!I580","v":"VETERANO"},{"$f":"'DATOS DEPORTISTAS'!M580","v":"RODRIGO GARCÍA SEGADO"}]
[null,{"$f":"'DATOS DEPORTISTAS'!V581","v":0},{"$f":"'DATOS DEPORTISTAS'!I581","v":"VETERANO"},{"$f":"'DATOS DEPORTISTAS'!M581","v":"ROI SILVA CASAL"}]
[null,{"$f":"'DATOS DEPORTISTAS'!V582","v":0},{"$f":"'DATOS DEPORTISTAS'!V582","v":0},{"$f":"'DATOS DEPORTISTAS'!M582","v":"ROSA RÍOS LÓPEZ"}]
[null,{"$f":"'DATOS DEPORTISTAS'!V583","v":0},{"$f":"'DATOS DEPORTISTAS'!I583","v":"SENIOR"},{"$f":"'DATOS DEPORTISTAS'!M583","v":"RUBÉN PELEGRÍN ROMERO"}]
[null,{"$f":"'DATOS DEPORTISTAS'!V584","v":0},{"$f":"'DATOS DEPORTISTAS'!I584","v":"INFANTIL"},{"$f":"'DATOS DEPORTISTAS'!M584","v":"RUBÉN SÁNCHEZ LLOP"}]
[null,{"$f":"'DATOS DEPORTISTAS'!V585","v":0},{"$f":"'DATOS DEPORTISTAS'!I585","v":"VETERANO"},{"$f":"'DATOS DEPORTISTAS'!M585","v":"RUTH ESTEBAN MARÍN"}]
[null,{"$f":"'DATOS DEPORTISTAS'!V586","v":0},{"$f":"'DATOS DEPORTISTAS'!I586","v":"JUVENIL"},{"$f":"'DATOS DEPORTISTAS'!M586","v":"SALMA BERGES ISAM-ALÍ"}]
[null,{"$f":"'DATOS DEPORTISTAS'!V587","v":0},{"$f":"'DATOS DEPORTISTAS'!I587","v":"SENIOR"},{"$f":"'DATOS DEPORTISTAS'!M587","v":"SANTIAGO BLACKALLER MARTÍNEZ"}]
[null,{"$f":"'DATOS DEPORTISTAS'!V588","v":0},{"$f":"'DATOS DEPORTISTAS'!I588","v":"JUVENIL"},{"$f":"'DATOS DEPORTISTAS'!M588","v":"SANTIAGO LACASTA TORRES"}]
[null,{"$f":"'DATOS DEPORTISTAS'!V589","v":0},{"$f":"'DATOS DEPORTISTAS'!I589","v":"VETERANO"},{"$f":"'DATOS DEPORTISTAS'!M589","v":"SARA BUIL LANGARITA"}]
[null,{"$f":"'DATOS DEPORTISTAS'!V590","v":0},{"$f":"'DATOS DEPORTISTAS'!I590","v":"SENIOR"},{"$f":"'DATOS DEPORTISTAS'!M590","v":"SARA EPGORGI ZOUGARI"}]
[null,{"$f":"'DATOS DEPORTISTAS'!V591","v":0},{"$f":"'DATOS DEPORTISTAS'!I591","v":"SENIOR"},{"$f":"'DATOS DEPORTISTAS'!M591","v":"SARA GRESA MUÑOZ"}]
[null,{"$f":"'DATOS DEPORTISTAS'!V592","v":0},{"$f":"'DATOS DEPORTISTAS'!I592","v":"VETERANO"},{"$f":"'DATOS DEPORTISTAS'!M592","v":"SARA MARTÍNEZ GARCÍA"}]
[null,{"$f":"'DATOS DEPORTISTAS'!V593","v":0},{"$f":"'DATOS DEPORTISTAS'!I593","v":"SENIOR"},{"$f":"'DATOS DEPORTISTAS'!M593","v":"SEBASTIÁN ALEJANDRO LUNA VALOROSO"}]
[null,{"$f":"'DATOS DEPORTISTAS'!V594","v":0},{"$f":"'DATOS DEPORTISTAS'!I594","v":"VETERANO"},{"$f":"'DATOS DEPORTISTAS'!M594","v":"SELMA PALACÍN ARTIGOSA"}]
[null,{"$f":"'DATOS DEPORTISTAS'!V595","v":0},{"$f":"'DATOS DEPORTISTAS'!I595","v":"VETERANO"},{"$f":"'DATOS DEPORTISTAS'!M595","v":"SERGIO AURED ANTÓN"}]
[null,{"$f":"'DATOS DEPORTISTAS'!V596","v":0},{"$f":"'DATOS DEPORTISTAS'!I596","v":"SENIOR"},{"$f":"'DATOS DEPORTISTAS'!M596","v":"SERGIO LORENTE CORTÉS"}]
[null,{"$f":"'DATOS DEPORTISTAS'!V597","v":0},{"$f":"'DATOS DEPORTISTAS'!I597","v":"SENIOR"},{"$f":"'DATOS DEPORTISTAS'!M597","v":"SERGIO MAGALLÓN TEJERO"}]
[null,{"$f":"'DATOS DEPORTISTAS'!V598","v":0},{"$f":"'DATOS DEPORTISTAS'!I598","v":"JUVENIL"},{"$f":"'DATOS DEPORTISTAS'!M598","v":"SHEILA ROY PARLANTE"}]
[null,{"$f":"'DATOS DEPORTISTAS'!V599","v":0},{"$f":"'DATOS DEPORTISTAS'!I599","v":"SENIOR"},{"$f":"'DATOS DEPORTISTAS'!M599","v":"SHELTER SASKIA GIMBEL-SHERR"}]
[null,{"$f":"'DATOS DEPORTISTAS'!V600","v":"C. DE REMO RETIRO 66"},{"$f":"'DATOS DEPORTISTAS'!I600","v":"VETERANO"},{"$f":"'DATOS DEPORTISTAS'!M600","v":"SOFÍA BLÁZQUEZ UGALDE"}]
[null,{"$f":"'DATOS DEPORTISTAS'!V601","v":0},{"$f":"'DATOS DEPORTISTAS'!I601","v":"SENIOR"},{"$f":"'DATOS DEPORTISTAS'!M601","v":"SOFÍA IBARZ TEIRA"}]
[null,{"$f":"'DATOS DEPORTISTAS'!V602","v":0},{"$f":"'DATOS DEPORTISTAS'!I602","v":"JUVENIL"},{"$f":"'DATOS DEPORTISTAS'!M602","v":"SOFÍA MURZAKOVA"}]
[null,{"$f":"'DATOS DEPORTISTAS'!V603","v":"C. DE REMO RETIRO 66"},{"$f":"'DATOS DEPORTISTAS'!I603","v":"VETERANO"},{"$f":"'DATOS DEPORTISTAS'!M603","v":"SONSOLES RUIZ JOUVÉ"}]
[null,{"$f":"'DATOS DEPORTISTAS'!V604","v":0},{"$f":"'DATOS DEPORTISTAS'!I604","v":"VETERANO"},{"$f":"'DATOS DEPORTISTAS'!M604","v":"SUSANA CIRAC BELTRÁN"}]
[null,{"$f":"'DATOS DEPORTISTAS'!V605","v":0},{"$f":"'DATOS DEPORTISTAS'!I605","v":"VETERANO"},{"$f":"'DATOS DEPORTISTAS'!M605","v":"SUSANA LÁZARO MUÑOZ"}]
[null,{"$f":"'DATOS DEPORTISTAS'!V606","v":"C. DE REMO RETIRO 66"},{"$f":"'DATOS DEPORTISTAS'!I606","v":"VETERANO"},{"$f":"'DATOS DEPORTISTAS'!M606","v":"SUSANA MONTERO REGUILÓN"}]
[null,{"$f":"'DATOS DEPORTISTAS'!V607","v":0},{"$f":"'DATOS DEPORTISTAS'!I607","v":"SENIOR"},{"$f":"'DATOS DEPORTISTAS'!M607","v":"SUSANA PONCE USÓN"}]
[null,{"$f":"'DATOS DEPORTISTAS'!V608","v":0},{"$f":"'DATOS DEPORTISTAS'!I608","v":"VETERANO"},{"$f":"'DATOS DEPORTISTAS'!M608","v":"TAMARA SARATLIC"}]
[null,{"$f":"'DATOS DEPORTISTAS'!V609","v":0},{"$f":"'DATOS DEPORTISTAS'!I609","v":"VETERANO"},{"$f":"'DATOS DEPORTISTAS'!M609","v":"TIMOTHY JAMES PITT"}]
[null,{"$f":"'DATOS DEPORTISTAS'!V610","v":0},{"$f":"'DATOS DEPORTISTAS'!I610","v":"SENIOR"},{"$f":"'DATOS DEPORTISTAS'!M610","v":"TOMÁS SEVIL DOMINGO"}]
[null,{"$f":"'DATOS DEPORTISTAS'!V611","v":0},{"$f":"'DATOS DEPORTISTAS'!I611","v":"JUVENIL"},{"$f":"'DATOS DEPORTISTAS'!M611","v":"VALENTÍN VILLALBA MULA"}]
[null,{"$f":"'DATOS DEPORTISTAS'!V612","v":0},{"$f":"'DATOS DEPORTISTAS'!I612","v":"INFANTIL"},{"$f":"'DATOS DEPORTISTAS'!M612","v":"VALENTINA  FRISA MORET"}]
[null,{"$f":"'DATOS DEPORTISTAS'!V613","v":0},{"$f":"'DATOS DEPORTISTAS'!V613","v":0},{"$f":"'DATOS DEPORTISTAS'!M613","v":"VICENTE DE LEÓN AZNAR"}]
[null,{"$f":"'DATOS DEPORTISTAS'!V614","v":0},{"$f":"'DATOS DEPORTISTAS'!I614","v":"VETERANO"},{"$f":"'DATOS DEPORTISTAS'!M614","v":"VÍCTOR CARRIÓN DE LAS HERAS"}]
[null,{"$f":"'DATOS DEPORTISTAS'!V615","v":0},{"$f":"'DATOS DEPORTISTAS'!I615","v":"INFANTIL"},{"$f":"'DATOS DEPORTISTAS'!M615","v":"VÍCTOR CATALÁN LLOP"}]
[null,{"$f":"'DATOS DEPORTISTAS'!V616","v":0},{"$f":"'DATOS DEPORTISTAS'!I616","v":"SENIOR"},{"$f":"'DATOS DEPORTISTAS'!M616","v":"VÍCTOR GIL GIL"}]
[null,{"$f":"'DATOS DEPORTISTAS'!V617","v":0},{"$f":"'DATOS DEPORTISTAS'!I617","v":"SENIOR"},{"$f":"'DATOS DEPORTISTAS'!M617","v":"VÍCTOR HERRAIZ LÓPEZ"}]
[null,{"$f":"'DATOS DEPORTISTAS'!V618","v":0},{"$f":"'DATOS DEPORTISTAS'!I618","v":"INFANTIL"},{"$f":"'DATOS DEPORTISTAS'!M618","v":"VICTORIA GARCIA ESCANDE"}]
[null,{"$f":"'DATOS DEPORTISTAS'!V619","v":0},{"$f":"'DATOS DEPORTISTAS'!I619","v":"JUVENIL"},{"$f":"'DATOS DEPORTISTAS'!M619","v":"VICTORIA LAPUENTE MARTÍN"}]
[null,{"$f":"'DATOS DEPORTISTAS'!V620","v":0},{"$f":"'DATOS DEPORTISTAS'!I620","v":"SENIOR"},{"$f":"'DATOS DEPORTISTAS'!M620","v":"WANNER FRANCISCO CHIRENO ROJAS"}]
[null,{"$f":"'DATOS DEPORTISTAS'!V621","v":0},{"$f":"'DATOS DEPORTISTAS'!I621","v":"VETERANO"},{"$f":"'DATOS DEPORTISTAS'!M621","v":"WILNER MANUEL ESCOBAR PERNOLETE"}]
[null,{"$f":"'DATOS DEPORTISTAS'!V622","v":0},{"$f":"'DATOS DEPORTISTAS'!I622","v":"JUVENIL"},{"$f":"'DATOS DEPORTISTAS'!M622","v":"XIMENA GÓMEZ SALINAS"}]
[null,{"$f":"'DATOS DEPORTISTAS'!V623","v":0},{"$f":"'DATOS DEPORTISTAS'!I623","v":"INFANTIL"},{"$f":"'DATOS DEPORTISTAS'!M623","v":"YAGO CORTÍ BETRIÁN"}]

{"sheet":"NAUTICO ZARAGOZA","index":10,"n_rows":23,"n_cols":29,"rows_kept":23,"cut":false,"hidden":true,"merged":[]}
[]
[null,null,null,null,null,null,"CLUB",null,"CATEGORIA"]
[null,null,null,null,null,null,{"$f":"_xlfn._xlws.SORT(_xlfn.UNIQUE(Tabla12[CLUB]))","v":0},null,{"$f":"_xlfn._xlws.SORT(_xlfn.UNIQUE(Tabla12[CAT.]))","v":0}]
[null,null,null,null,null,null,"ARAGÓN REMO",null,"ALEVIN"]
[null,null,null,null,null,null,"C. DE REMO RETIRO 66",null,"BENJAMIN"]
[null,null,null,null,null,null,"CAPRI MEQUINENZA",null,"CADETE"]
[null,null,null,null,null,null,"CENTRO NATACION HELIOS",null,"F.A.R."]
[null,null,null,null,null,null,"F.A.R.",null,"INFANTIL"]
[null,null,null,null,null,null,"NAUTICO ZARAGOZA",null,"JUVENIL"]
[null,null,null,null,null,null,"OS NABATERS",null,"SENIOR"]
[null,null,null,null,null,null,"OS NABATERS D.F.",null,"VETERANO"]
[]
[]
[]
[null,null,"CLUB","CATEGORIA",null,null,"CLUB","CATEGORIA",null,null,"CLUB","CATEGORIA",null,null,"CLUB","CATEGORIA",null,null,"CLUB","CATEGORIA",null,null,"CLUB","CATEGORIA",null,null,"CLUB","CATEGORIA"]
[null,null,"NAUTICO ZARAGOZA","VETERANO",null,null,"NAUTICO ZARAGOZA","SENIOR",null,null,"NAUTICO ZARAGOZA","JUVENIL",null,null,"NAUTICO ZARAGOZA","CADETE",null,null,"NAUTICO ZARAGOZA","INFANTIL",null,null,"NAUTICO ZARAGOZA","ALEVIN",null,null,"NAUTICO ZARAGOZA","BENJAMIN"]
[]
[]
[null,null,"CLUB","CAT.","NOMBRE COMPLETO",null,"CLUB","CAT.","NOMBRE COMPLETO",null,"CLUB","CAT.","NOMBRE COMPLETO",null,"CLUB","CAT.","NOMBRE COMPLETO",null,"CLUB","CAT.","NOMBRE COMPLETO",null,"CLUB","CAT.","NOMBRE COMPLETO",null,"CLUB","CAT.","NOMBRE COMPLETO"]
[null,null,{"$f":"_xlfn._xlws.SORT(_xlfn._xlws.FILTER(FILTRADO,(Tabla12[CLUB]=C16)*(Tabla12[CAT.]=D16)),3,1)","v":"NAUTICO ZARAGOZA"},"VETERANO","CLEMENTE FERNANDO LABORDA VAL",null,{"$f":"_xlfn._xlws.SORT(_xlfn._xlws.FILTER(FILTRADO,(Tabla12[CLUB]=G16)*(Tabla12[CAT.]=H16)),3,1)","v":{"$error":"#VALUE!"}},null,null,null,{"$f":"_xlfn._xlws.SORT(_xlfn._xlws.FILTER(FILTRADO,(Tabla12[CLUB]=K16)*(Tabla12[CAT.]=L16)),3,1)","v":{"$error":"#VALUE!"}},null,null,null,{"$f":"_xlfn._xlws.SORT(_xlfn._xlws.FILTER(FILTRADO,(Tabla12[CLUB]=O16)*(Tabla12[CAT.]=P16)),3,1)","v":{"$error":"#VALUE!"}},null,null,null,{"$f":"_xlfn._xlws.SORT(_xlfn._xlws.FILTER(FILTRADO,(Tabla12[CLUB]=S16)*(Tabla12[CAT.]=T16)),3,1)","v":{"$error":"#VALUE!"}},null,null,null,{"$f":"_xlfn._xlws.SORT(_xlfn._xlws.FILTER(FILTRADO,(Tabla12[CLUB]=W16)*(Tabla12[CAT.]=X16)),3,1)","v":{"$error":"#VALUE!"}},null,null,null,{"$f":"_xlfn._xlws.SORT(_xlfn._xlws.FILTER(FILTRADO,(Tabla12[CLUB]=AA16)*(Tabla12[CAT.]=AB16)),3,1)","v":{"$error":"#VALUE!"}}]
[null,null,"NAUTICO ZARAGOZA","VETERANO","IGNACIO JOSÉ RUIZ IRIBARNE"]
[null,null,"NAUTICO ZARAGOZA","VETERANO","JOSÉ MANUEL LARROY CALVO"]
[null,null,"NAUTICO ZARAGOZA","VETERANO","TEODORO TOBOSO MORENO"]

{"sheet":"OS NABATERS","index":11,"n_rows":58,"n_cols":29,"rows_kept":58,"cut":false,"hidden":true,"merged":[]}
[]
[null,null,null,null,null,null,"CLUB",null,"CATEGORIA"]
[null,null,null,null,null,null,{"$f":"_xlfn._xlws.SORT(_xlfn.UNIQUE(Tabla12[CLUB]))","v":0},null,{"$f":"_xlfn._xlws.SORT(_xlfn.UNIQUE(Tabla12[CAT.]))","v":0}]
[null,null,null,null,null,null,"ARAGÓN REMO",null,"ALEVIN"]
[null,null,null,null,null,null,"C. DE REMO RETIRO 66",null,"BENJAMIN"]
[null,null,null,null,null,null,"CAPRI MEQUINENZA",null,"CADETE"]
[null,null,null,null,null,null,"CENTRO NATACION HELIOS",null,"F.A.R."]
[null,null,null,null,null,null,"F.A.R.",null,"INFANTIL"]
[null,null,null,null,null,null,"NAUTICO ZARAGOZA",null,"JUVENIL"]
[null,null,null,null,null,null,"OS NABATERS",null,"SENIOR"]
[null,null,null,null,null,null,"OS NABATERS D.F.",null,"VETERANO"]
[]
[]
[]
[null,null,"CLUB","CATEGORIA",null,null,"CLUB","CATEGORIA",null,null,"CLUB","CATEGORIA",null,null,"CLUB","CATEGORIA",null,null,"CLUB","CATEGORIA",null,null,"CLUB","CATEGORIA",null,null,"CLUB","CATEGORIA"]
[null,null,"OS NABATERS D.F.","VETERANO",null,null,"OS NABATERS D.F.","SENIOR",null,null,"OS NABATERS D.F.","JUVENIL",null,null,"OS NABATERS D.F.","CADETE",null,null,"OS NABATERS D.F.","INFANTIL",null,null,"OS NABATERS D.F.","ALEVIN",null,null,"OS NABATERS D.F.","BENJAMIN"]
[]
[]
[null,null,"CLUB","CAT.","NOMBRE COMPLETO",null,"CLUB","CAT.","NOMBRE COMPLETO",null,"CLUB","CAT.","NOMBRE COMPLETO",null,"CLUB","CAT.","NOMBRE COMPLETO",null,"CLUB","CAT.","NOMBRE COMPLETO",null,"CLUB","CAT.","NOMBRE COMPLETO",null,"CLUB","CAT.","NOMBRE COMPLETO"]
[null,null,{"$f":"_xlfn._xlws.SORT(_xlfn._xlws.FILTER(FILTRADO,(Tabla12[CLUB]=C16)*(Tabla12[CAT.]=D16)),3,1)","v":"OS NABATERS D.F."},"VETERANO","ABEL RICARDO OVALLES GUERRA",null,{"$f":"_xlfn._xlws.SORT(_xlfn._xlws.FILTER(FILTRADO,(Tabla12[CLUB]=G16)*(Tabla12[CAT.]=H16)),3,1)","v":"OS NABATERS D.F."},"SENIOR","ALEJANDRO VILLACAMPA RÍOS",null,{"$f":"_xlfn._xlws.SORT(_xlfn._xlws.FILTER(FILTRADO,(Tabla12[CLUB]=K16)*(Tabla12[CAT.]=L16)),3,1)","v":"OS NABATERS D.F."},"JUVENIL","ADRIÁN AZNAR SAMPER",null,{"$f":"_xlfn._xlws.SORT(_xlfn._xlws.FILTER(FILTRADO,(Tabla12[CLUB]=O16)*(Tabla12[CAT.]=P16)),3,1)","v":"OS NABATERS D.F."},"CADETE","DARÍO CANO JIMÉNEZ",null,{"$f":"_xlfn._xlws.SORT(_xlfn._xlws.FILTER(FILTRADO,(Tabla12[CLUB]=S16)*(Tabla12[CAT.]=T16)),3,1)","v":"OS NABATERS D.F."},"INFANTIL","ALEJANDRO DUCE CASCANTE",null,{"$f":"_xlfn._xlws.SORT(_xlfn._xlws.FILTER(FILTRADO,(Tabla12[CLUB]=W16)*(Tabla12[CAT.]=X16)),3,1)","v":"OS NABATERS D.F."},"ALEVIN","RUBÉN SORIA GARCÍA",null,{"$f":"_xlfn._xlws.SORT(_xlfn._xlws.FILTER(FILTRADO,(Tabla12[CLUB]=AA16)*(Tabla12[CAT.]=AB16)),3,1)","v":"OS NABATERS D.F."},"BENJAMIN","JORGE OBENSA SIERRA"]
[null,null,"OS NABATERS D.F.","VETERANO","ALEJANDRO DEL AMO SANCHO",null,"OS NABATERS D.F.","SENIOR","ALODIA SANCHO BUSTÍN",null,"OS NABATERS D.F.","JUVENIL","CLAUDIA ASO LÓPEZ",null,null,null,null,null,"OS NABATERS D.F.","INFANTIL","CÉSAR DÍEZ MOZOTA",null,"OS NABATERS D.F.","ALEVIN","SIENA GIMENO BACHILLER",null,"OS NABATERS D.F.","BENJAMIN","LEO HIDALGO FERNÁNDEZ"]
[null,null,"OS NABATERS D.F.","VETERANO","ALICIA PILAR ESTEVAN EIXARCH",null,"OS NABATERS D.F.","SENIOR","ANA RUBIO EZPELETA",null,"OS NABATERS D.F.","JUVENIL","GERMÁN FAUBELL MACÍA",null,null,null,null,null,"OS NABATERS D.F.","INFANTIL","DAVID MARCOS GARCÍA",null,null,null,null,null,"OS NABATERS D.F.","BENJAMIN","VÍCTOR IVZHENKO"]
[null,null,"OS NABATERS D.F.","VETERANO","ALICIA ROMERO DE LA ROSA",null,"OS NABATERS D.F.","SENIOR","ANDREA HERNANDO FERRER",null,"OS NABATERS D.F.","JUVENIL","LUIS FRANCISCO BOIRA GONZALO",null,null,null,null,null,"OS NABATERS D.F.","INFANTIL","MARÍA ADELINA MARTISCA SUSANU"]
[null,null,"OS NABATERS D.F.","VETERANO","ANDREA MATAIX MONTANER",null,"OS NABATERS D.F.","SENIOR","ÁNGEL BERNAL LECINA",null,"OS NABATERS D.F.","JUVENIL","SARA BAILO GARCÍA",null,null,null,null,null,"OS NABATERS D.F.","INFANTIL","YUSRA SORKHABI"]
[null,null,"OS NABATERS D.F.","VETERANO","ÁNGEL AGUILERA ANDRÉS",null,"OS NABATERS D.F.","SENIOR","BORJA COSA REDONDO",null,"OS NABATERS D.F.","JUVENIL","SARA MARTÍN RANERA"]
[null,null,"OS NABATERS D.F.","VETERANO","ÁNGEL DE MIGUEL BENITO",null,"OS NABATERS D.F.","SENIOR","CARLOTA LAPLANA DÍAZ"]
[null,null,"OS NABATERS D.F.","VETERANO","ANTONIO ANSELMO SANCHO NAVARRO",null,"OS NABATERS D.F.","SENIOR","CELIA PEÑA ROMERO DE TEJADA"]
[null,null,"OS NABATERS D.F.","VETERANO","DAVID OLMO NADAL",null,"OS NABATERS D.F.","SENIOR","ELENA CID RUIZ"]
[null,null,"OS NABATERS D.F.","VETERANO","EMANUEL ALEXANDRU-GEORGESCU",null,"OS NABATERS D.F.","SENIOR","GUILLÉN VICENTE MIRANDA"]
[null,null,"OS NABATERS D.F.","VETERANO","FRANCISCO HERNÁNDEZ RODRÍGUEZ",null,"OS NABATERS D.F.","SENIOR","ITZIAR MARURI GARCÍA"]
[null,null,"OS NABATERS D.F.","VETERANO","GABRIEL JOSÉ RUANO FERNÁNDEZ",null,"OS NABATERS D.F.","SENIOR","JAIME PEÑA ROMERO DE TEJADA"]
[null,null,"OS NABATERS D.F.","VETERANO","IGNACIO HERNÁNDEZ ARAGÜET",null,"OS NABATERS D.F.","SENIOR","JESÚS MARÍA VILLAR QUINTANA"]
[null,null,"OS NABATERS D.F.","VETERANO","ISCICIO NAVARRETE SÁNCHEZ",null,"OS NABATERS D.F.","SENIOR","JHONATHAN ESTYVEN DÍAZ TORNIÉ"]
[null,null,"OS NABATERS D.F.","VETERANO","JAVIER ROMEO GIL",null,"OS NABATERS D.F.","SENIOR","JORGE PONCE USÓN"]
[null,null,"OS NABATERS D.F.","VETERANO","JOSÉ ÁNGEL GRACIA AGUSTÍN",null,"OS NABATERS D.F.","SENIOR","JUAN JOSÉ MUÑOZ LAHOZ"]
[null,null,"OS NABATERS D.F.","VETERANO","JOSÉ IGNACIO MAGDALENA ABAD",null,"OS NABATERS D.F.","SENIOR","JUAN MUÑOZ LÓPEZ"]
[null,null,"OS NABATERS D.F.","VETERANO","JOSÉ LUIS CAMBERO CENZANO",null,"OS NABATERS D.F.","SENIOR","PEDRO OLLOQUI LÁZARO"]
[null,null,"OS NABATERS D.F.","VETERANO","JOSÉ LUIS HERNÁNDEZ PASCUAL",null,"OS NABATERS D.F.","SENIOR","RAQUEL DE MIGUEL GRACIA"]
[null,null,"OS NABATERS D.F.","VETERANO","JOSÉ LUIS MARTÍN ESCUÍN",null,"OS NABATERS D.F.","SENIOR","RAQUEL HERNÁNDEZ ROYO"]
[null,null,"OS NABATERS D.F.","VETERANO","JOSÉ MARÍA EMBARBA LABORDA",null,"OS NABATERS D.F.","SENIOR","RAÚL GRACIA ANDIANO"]
[null,null,"OS NABATERS D.F.","VETERANO","JOSÉ SALVADOR BARRERA RAMOS",null,"OS NABATERS D.F.","SENIOR","TATIANA CANO GALLEGO"]
[null,null,"OS NABATERS D.F.","VETERANO","JUAN ALEGRE TRIS",null,"OS NABATERS D.F.","SENIOR","TOMÁS PELAYO BENEDET"]
[null,null,"OS NABATERS D.F.","VETERANO","LUIS ALBERTO IBARRA"]
[null,null,"OS NABATERS D.F.","VETERANO","LUIS CARLOS BELLED LACASA"]
[null,null,"OS NABATERS D.F.","VETERANO","LUIS JAVIER MELERO PASCUAL"]
[null,null,"OS NABATERS D.F.","VETERANO","MARÍA AZUCENA FERNÁNDEZ RUIZ"]
[null,null,"OS NABATERS D.F.","VETERANO","MERCEDES GIMÉNEZ HERRERO"]
[null,null,"OS NABATERS D.F.","VETERANO","MIGUEL BEA GONZÁLEZ"]
[null,null,"OS NABATERS D.F.","VETERANO","NAOMI SANCHO BUSTÍN"]
[null,null,"OS NABATERS D.F.","VETERANO","OMAR SEBASTIÁN BUSTÍN"]
[null,null,"OS NABATERS D.F.","VETERANO","PEDRO DANIEL PLOU ARTAL"]
[null,null,"OS NABATERS D.F.","VETERANO","PEDRO IGNACIO MARTÍNEZ CABELLO"]
[null,null,"OS NABATERS D.F.","VETERANO","RAÚL DÍEZ DÍEZ"]
[null,null,"OS NABATERS D.F.","VETERANO","RICARDO SALILLAS MARTÍNEZ"]
[null,null,"OS NABATERS D.F.","VETERANO","ROBERTO NAVARRO CARRETERO"]
[null,null,"OS NABATERS D.F.","VETERANO","SANTIAGO LAVILLA TENÍAS"]
[null,null,"OS NABATERS D.F.","VETERANO","SERGIO AURED ANTÓN"]
[null,null,"OS NABATERS D.F.","VETERANO","SUSANA ESTABLÉS SUJÁN"]

{"sheet":"CAPRI MEQUINENZA","index":12,"n_rows":52,"n_cols":29,"rows_kept":52,"cut":false,"hidden":true,"merged":[]}
[]
[null,null,null,null,null,null,"CLUB",null,"CATEGORIA"]
[null,null,null,null,null,null,{"$f":"_xlfn._xlws.SORT(_xlfn.UNIQUE(Tabla12[CLUB]))","v":0},null,{"$f":"_xlfn._xlws.SORT(_xlfn.UNIQUE(Tabla12[CAT.]))","v":0}]
[null,null,null,null,null,null,"ARAGÓN REMO",null,"ALEVIN"]
[null,null,null,null,null,null,"C. DE REMO RETIRO 66",null,"BENJAMIN"]
[null,null,null,null,null,null,"CAPRI MEQUINENZA",null,"CADETE"]
[null,null,null,null,null,null,"CENTRO NATACION HELIOS",null,"F.A.R."]
[null,null,null,null,null,null,"F.A.R.",null,"INFANTIL"]
[null,null,null,null,null,null,"NAUTICO ZARAGOZA",null,"JUVENIL"]
[null,null,null,null,null,null,"OS NABATERS",null,"SENIOR"]
[null,null,null,null,null,null,"OS NABATERS D.F.",null,"VETERANO"]
[]
[]
[]
[null,null,"CLUB","CATEGORIA",null,null,"CLUB","CATEGORIA",null,null,"CLUB","CATEGORIA",null,null,"CLUB","CATEGORIA",null,null,"CLUB","CATEGORIA",null,null,"CLUB","CATEGORIA",null,null,"CLUB","CATEGORIA"]
[null,null,"CAPRI MEQUINENZA","VETERANO",null,null,"CAPRI MEQUINENZA","SENIOR",null,null,"CAPRI MEQUINENZA","JUVENIL",null,null,"CAPRI MEQUINENZA","CADETE",null,null,"CAPRI MEQUINENZA","INFANTIL",null,null,"CAPRI MEQUINENZA","ALEVIN",null,null,"CAPRI MEQUINENZA","BENJAMIN"]
[]
[]
[null,null,"CLUB","CAT.","NOMBRE COMPLETO",null,"CLUB","CAT.","NOMBRE COMPLETO",null,"CLUB","CAT.","NOMBRE COMPLETO",null,"CLUB","CAT.","NOMBRE COMPLETO",null,"CLUB","CAT.","NOMBRE COMPLETO",null,"CLUB","CAT.","NOMBRE COMPLETO",null,"CLUB","CAT.","NOMBRE COMPLETO"]
[null,null,{"$f":"_xlfn._xlws.SORT(_xlfn._xlws.FILTER(FILTRADO,(Tabla12[CLUB]=C16)*(Tabla12[CAT.]=D16)),3,1)","v":"CAPRI MEQUINENZA"},"VETERANO","ALFONSO PÉREZ ALONSO",null,{"$f":"_xlfn._xlws.SORT(_xlfn._xlws.FILTER(FILTRADO,(Tabla12[CLUB]=G16)*(Tabla12[CAT.]=H16)),3,1)","v":"CAPRI MEQUINENZA"},"SENIOR","CARLA MARÍA TEIRA ARBIOL",null,{"$f":"_xlfn._xlws.SORT(_xlfn._xlws.FILTER(FILTRADO,(Tabla12[CLUB]=K16)*(Tabla12[CAT.]=L16)),3,1)","v":"CAPRI MEQUINENZA"},"JUVENIL","AARÓN MÁRQUEZ GUARDIOLA",null,{"$f":"_xlfn._xlws.SORT(_xlfn._xlws.FILTER(FILTRADO,(Tabla12[CLUB]=O16)*(Tabla12[CAT.]=P16)),3,1)","v":"CAPRI MEQUINENZA"},"CADETE","ÁLEX VILELLA BERENGUER",null,{"$f":"_xlfn._xlws.SORT(_xlfn._xlws.FILTER(FILTRADO,(Tabla12[CLUB]=S16)*(Tabla12[CAT.]=T16)),3,1)","v":"CAPRI MEQUINENZA"},"INFANTIL","ABRIL GONZÁLEZ GARCÍA",null,{"$f":"_xlfn._xlws.SORT(_xlfn._xlws.FILTER(FILTRADO,(Tabla12[CLUB]=W16)*(Tabla12[CAT.]=X16)),3,1)","v":"CAPRI MEQUINENZA"},"ALEVIN","ALBA MARTÍNEZ CLAVERO",null,{"$f":"_xlfn._xlws.SORT(_xlfn._xlws.FILTER(FILTRADO,(Tabla12[CLUB]=AA16)*(Tabla12[CAT.]=AB16)),3,1)","v":"CAPRI MEQUINENZA"},"BENJAMIN","ALICIA LLOP RUEDA"]
[null,null,"CAPRI MEQUINENZA","VETERANO","ANTONIO MIGUEL VERA RUBERT",null,"CAPRI MEQUINENZA","SENIOR","ELENA STEGHERR LLOP",null,"CAPRI MEQUINENZA","JUVENIL","GISELA HIERRO GARCÍA",null,"CAPRI MEQUINENZA","CADETE","DIEGO AGUILAR ROMERO",null,"CAPRI MEQUINENZA","INFANTIL","ALBA CUCHÍ NIUBÓ",null,"CAPRI MEQUINENZA","ALEVIN","ALEJANDRO CANTERO ANDRÉS",null,"CAPRI MEQUINENZA","BENJAMIN","CARMEN RODES ESTRUGA"]
[null,null,"CAPRI MEQUINENZA","VETERANO","CARLOS SANJUAN SOLER",null,"CAPRI MEQUINENZA","SENIOR","HELENA BERNAL LACRUZ",null,"CAPRI MEQUINENZA","JUVENIL","IVÁN GODIA SANCHO",null,"CAPRI MEQUINENZA","CADETE","ERIKA GODIA NICOLAU",null,"CAPRI MEQUINENZA","INFANTIL","AROA CASTELLÓ VILA",null,"CAPRI MEQUINENZA","ALEVIN","ALEX CATALÁN MOYA",null,"CAPRI MEQUINENZA","BENJAMIN","ENZO EXPÓSITO SORO"]
[null,null,"CAPRI MEQUINENZA","VETERANO","CONCEPCIÓN CASTRO ARANDA",null,"CAPRI MEQUINENZA","SENIOR","JUDITH  GRAU BURRIEL",null,"CAPRI MEQUINENZA","JUVENIL","MOHAMED ADAM RAHIBI VIDALLET",null,"CAPRI MEQUINENZA","CADETE","IRATXE IBARZ BERENGUER",null,"CAPRI MEQUINENZA","INFANTIL","IVÁN CASTELLNOU SOROLLA",null,"CAPRI MEQUINENZA","ALEVIN","ANDREW PI MOSOVSKA",null,"CAPRI MEQUINENZA","BENJAMIN","IBAI BLAS PEÑALVER"]
[null,null,"CAPRI MEQUINENZA","VETERANO","DANIEL CUCHÍ SAGARRA",null,"CAPRI MEQUINENZA","SENIOR","JULIA RAMI CASTRO",null,"CAPRI MEQUINENZA","JUVENIL","TIBERIU GABRIEL DAMIÁN",null,"CAPRI MEQUINENZA","CADETE","IRENE BRUNA PALAU",null,"CAPRI MEQUINENZA","INFANTIL","JOKIN KOLDO ESCALONA VILLACAMPA",null,"CAPRI MEQUINENZA","ALEVIN","ERIC ROCA VENTURA",null,"CAPRI MEQUINENZA","BENJAMIN","IVÁN EXPÓSITO VARGAS"]
[null,null,"CAPRI MEQUINENZA","VETERANO","DAVID OLIVER CABALLÉ",null,"CAPRI MEQUINENZA","SENIOR","KIARA VALVERDE ANDRÉS",null,null,null,null,null,"CAPRI MEQUINENZA","CADETE","IRIA EXPÓSITO SORO",null,"CAPRI MEQUINENZA","INFANTIL","MARÍA ARROYO CABALLÉ",null,"CAPRI MEQUINENZA","ALEVIN","IKER SANJUÁN SATORRES",null,"CAPRI MEQUINENZA","BENJAMIN","MARC CASTELLO VILA"]
[null,null,"CAPRI MEQUINENZA","VETERANO","DAVID TORO SOLER",null,"CAPRI MEQUINENZA","SENIOR","MARÍA PILAR GODIA PI",null,null,null,null,null,"CAPRI MEQUINENZA","CADETE","ISMAEL RAHIBI VIDALLET",null,null,null,null,null,"CAPRI MEQUINENZA","ALEVIN","JOEL CHERTÓ JIMÉNEZ",null,"CAPRI MEQUINENZA","BENJAMIN","MARÍA AGUILAR ROMERO"]
[null,null,"CAPRI MEQUINENZA","VETERANO","EDUARDO ROMERA MURILLO",null,"CAPRI MEQUINENZA","SENIOR","MIGUEL RUBIO LAMBEA",null,null,null,null,null,"CAPRI MEQUINENZA","CADETE","MARINA CATALÁN MOYA",null,null,null,null,null,"CAPRI MEQUINENZA","ALEVIN","ONA ESTRUGA LLOP",null,"CAPRI MEQUINENZA","BENJAMIN","MAX GUARDIOLA LOPERA"]
[null,null,"CAPRI MEQUINENZA","VETERANO","ESTHER ANDRÉS CARRILLO",null,"CAPRI MEQUINENZA","SENIOR","SARA SERVETO ORDUÑA",null,null,null,null,null,"CAPRI MEQUINENZA","CADETE","MIRIAM BRUNA PALAU",null,null,null,null,null,"CAPRI MEQUINENZA","ALEVIN","SAÚL VIU NOGUÉS",null,"CAPRI MEQUINENZA","BENJAMIN","NOA  GARCIA SERRANO"]
[null,null,"CAPRI MEQUINENZA","VETERANO","JESÚS MANUEL LLOP MONTULL",null,null,null,null,null,null,null,null,null,"CAPRI MEQUINENZA","CADETE","PAULO GUIMERÁ JANIK",null,null,null,null,null,null,null,null,null,"CAPRI MEQUINENZA","BENJAMIN","PAULA CUCHÍ NIUBÓ"]
[null,null,"CAPRI MEQUINENZA","VETERANO","JORDI CASTELLÓ ROCA",null,null,null,null,null,null,null,null,null,"CAPRI MEQUINENZA","CADETE","SOFÍA SERVETO ORDUÑA",null,null,null,null,null,null,null,null,null,"CAPRI MEQUINENZA","BENJAMIN","YUNE JUSTE IBARZ"]
[null,null,"CAPRI MEQUINENZA","VETERANO","JORGE MANUEL AGUILAR OLIVER",null,null,null,null,null,null,null,null,null,"CAPRI MEQUINENZA","CADETE","YERAY MARTÍNEZ CLAVERO"]
[null,null,"CAPRI MEQUINENZA","VETERANO","JOSÉ RAMÓN PALAU MARIMÓN"]
[null,null,"CAPRI MEQUINENZA","VETERANO","JOSEP REINADO VIRGILI"]
[null,null,"CAPRI MEQUINENZA","VETERANO","JUAN ANTONIO  CATALAN MULA"]
[null,null,"CAPRI MEQUINENZA","VETERANO","LORENA NOGUÉS NICOLÁS"]
[null,null,"CAPRI MEQUINENZA","VETERANO","LUIS ESTEVE CATALÁN"]
[null,null,"CAPRI MEQUINENZA","VETERANO","Mª CARMEN GARCÍA ARANDA"]
[null,null,"CAPRI MEQUINENZA","VETERANO","MARCELO ITHARTE"]
[null,null,"CAPRI MEQUINENZA","VETERANO","MARÍA TERESA GODIA PI"]
[null,null,"CAPRI MEQUINENZA","VETERANO","MARISOL CLAVERO GARCÍA"]
[null,null,"CAPRI MEQUINENZA","VETERANO","MERITXELL  LLOP CALLIZO"]
[null,null,"CAPRI MEQUINENZA","VETERANO","OLIVER FERNÁNDEZ GIL"]
[null,null,"CAPRI MEQUINENZA","VETERANO","ORIOL  MIR IBARZ"]
[null,null,"CAPRI MEQUINENZA","VETERANO","PATRYCJA JANIK"]
[null,null,"CAPRI MEQUINENZA","VETERANO","PEDRO JOSÉ SERVETO PALOMAR"]
[null,null,"CAPRI MEQUINENZA","VETERANO","RAQUEL CABALLÉ SILVESTRE"]
[null,null,"CAPRI MEQUINENZA","VETERANO","ROSA MARÍA LLOP RIAU"]
[null,null,"CAPRI MEQUINENZA","VETERANO","ROSANA NIUBÓ SOROLLA"]
[null,null,"CAPRI MEQUINENZA","VETERANO","RUBÉN  ALDABÓ LABAILA"]
[null,null,"CAPRI MEQUINENZA","VETERANO","SARA  ROMERO OLMOS"]
[null,null,"CAPRI MEQUINENZA","VETERANO","VÍCTOR ESTRUGA GIMENO"]
[null,null,"CAPRI MEQUINENZA","VETERANO","VICTORIA SANTAELLA MAIRELES"]

{"sheet":"ARAGON REMO","index":13,"n_rows":24,"n_cols":29,"rows_kept":24,"cut":false,"hidden":true,"merged":[]}
[]
[null,null,null,null,null,null,"CLUB",null,"CATEGORIA"]
[null,null,null,null,null,null,{"$f":"_xlfn._xlws.SORT(_xlfn.UNIQUE(Tabla12[CLUB]))","v":0},null,{"$f":"_xlfn._xlws.SORT(_xlfn.UNIQUE(Tabla12[CAT.]))","v":0}]
[null,null,null,null,null,null,"ARAGÓN REMO",null,"ALEVIN"]
[null,null,null,null,null,null,"C. DE REMO RETIRO 66",null,"BENJAMIN"]
[null,null,null,null,null,null,"CAPRI MEQUINENZA",null,"CADETE"]
[null,null,null,null,null,null,"CENTRO NATACION HELIOS",null,"F.A.R."]
[null,null,null,null,null,null,"F.A.R.",null,"INFANTIL"]
[null,null,null,null,null,null,"NAUTICO ZARAGOZA",null,"JUVENIL"]
[null,null,null,null,null,null,"OS NABATERS",null,"SENIOR"]
[null,null,null,null,null,null,"OS NABATERS D.F.",null,"VETERANO"]
[]
[]
[]
[null,null,"CLUB","CATEGORIA",null,null,"CLUB","CATEGORIA",null,null,"CLUB","CATEGORIA",null,null,"CLUB","CATEGORIA",null,null,"CLUB","CATEGORIA",null,null,"CLUB","CATEGORIA",null,null,"CLUB","CATEGORIA"]
[null,null,"ARAGÓN REMO","VETERANO",null,null,"ARAGÓN REMO","SENIOR",null,null,"ARAGÓN REMO","JUVENIL",null,null,"ARAGÓN REMO","CADETE",null,null,"ARAGÓN REMO","INFANTIL",null,null,"ARAGÓN REMO","ALEVIN",null,null,"ARAGÓN REMO","BENJAMIN"]
[]
[]
[null,null,"CLUB","CAT.","NOMBRE COMPLETO",null,"CLUB","CAT.","NOMBRE COMPLETO",null,"CLUB","CAT.","NOMBRE COMPLETO",null,"CLUB","CAT.","NOMBRE COMPLETO",null,"CLUB","CAT.","NOMBRE COMPLETO",null,"CLUB","CAT.","NOMBRE COMPLETO",null,"CLUB","CAT.","NOMBRE COMPLETO"]
[null,null,{"$f":"_xlfn._xlws.SORT(_xlfn._xlws.FILTER(FILTRADO,(Tabla12[CLUB]=C16)*(Tabla12[CAT.]=D16)),3,1)","v":"ARAGÓN REMO"},"VETERANO","CARLOS MILLÁN BLASCO",null,{"$f":"_xlfn._xlws.SORT(_xlfn._xlws.FILTER(FILTRADO,(Tabla12[CLUB]=G16)*(Tabla12[CAT.]=H16)),3,1)","v":{"$error":"#VALUE!"}},null,null,null,{"$f":"_xlfn._xlws.SORT(_xlfn._xlws.FILTER(FILTRADO,(Tabla12[CLUB]=K16)*(Tabla12[CAT.]=L16)),3,1)","v":{"$error":"#VALUE!"}},null,null,null,{"$f":"_xlfn._xlws.SORT(_xlfn._xlws.FILTER(FILTRADO,(Tabla12[CLUB]=O16)*(Tabla12[CAT.]=P16)),3,1)","v":{"$error":"#VALUE!"}},null,null,null,{"$f":"_xlfn._xlws.SORT(_xlfn._xlws.FILTER(FILTRADO,(Tabla12[CLUB]=S16)*(Tabla12[CAT.]=T16)),3,1)","v":{"$error":"#VALUE!"}},null,null,null,{"$f":"_xlfn._xlws.SORT(_xlfn._xlws.FILTER(FILTRADO,(Tabla12[CLUB]=W16)*(Tabla12[CAT.]=X16)),3,1)","v":{"$error":"#VALUE!"}},null,null,null,{"$f":"_xlfn._xlws.SORT(_xlfn._xlws.FILTER(FILTRADO,(Tabla12[CLUB]=AA16)*(Tabla12[CAT.]=AB16)),3,1)","v":{"$error":"#VALUE!"}}]
[null,null,"ARAGÓN REMO","VETERANO","DAVID SAN JOSÉ SANTAMARÍA"]
[null,null,"ARAGÓN REMO","VETERANO","FERNANDO CARLOS MILLÁN MAINAR"]
[null,null,"ARAGÓN REMO","VETERANO","JOSÉ MANUEL LABARTA PINILLA"]
[null,null,"ARAGÓN REMO","VETERANO","SOFÍA EVA GÓMEZ GÓMEZ"]

{"sheet":"REMO ZARAGOZA","index":14,"n_rows":20,"n_cols":29,"rows_kept":20,"cut":false,"hidden":true,"merged":[]}
[]
[null,null,null,null,null,null,"CLUB",null,"CATEGORIA"]
[null,null,null,null,null,null,{"$f":"_xlfn._xlws.SORT(_xlfn.UNIQUE(Tabla12[CLUB]))","v":0},null,{"$f":"_xlfn._xlws.SORT(_xlfn.UNIQUE(Tabla12[CAT.]))","v":0}]
[null,null,null,null,null,null,"ARAGÓN REMO",null,"ALEVIN"]
[null,null,null,null,null,null,"C. DE REMO RETIRO 66",null,"BENJAMIN"]
[null,null,null,null,null,null,"CAPRI MEQUINENZA",null,"CADETE"]
[null,null,null,null,null,null,"CENTRO NATACION HELIOS",null,"F.A.R."]
[null,null,null,null,null,null,"F.A.R.",null,"INFANTIL"]
[null,null,null,null,null,null,"NAUTICO ZARAGOZA",null,"JUVENIL"]
[null,null,null,null,null,null,"OS NABATERS",null,"SENIOR"]
[null,null,null,null,null,null,"OS NABATERS D.F.",null,"VETERANO"]
[]
[]
[]
[null,null,"CLUB","CATEGORIA",null,null,"CLUB","CATEGORIA",null,null,"CLUB","CATEGORIA",null,null,"CLUB","CATEGORIA",null,null,"CLUB","CATEGORIA",null,null,"CLUB","CATEGORIA",null,null,"CLUB","CATEGORIA"]
[null,null,"REMO ZARAGOZA","VETERANO",null,null,"REMO ZARAGOZA","SENIOR",null,null,"REMO ZARAGOZA","JUVENIL",null,null,"REMO ZARAGOZA","CADETE",null,null,"REMO ZARAGOZA","INFANTIL",null,null,"REMO ZARAGOZA","ALEVIN",null,null,"REMO ZARAGOZA","BENJAMIN"]
[]
[]
[null,null,"CLUB","CAT.","NOMBRE COMPLETO",null,"CLUB","CAT.","NOMBRE COMPLETO",null,"CLUB","CAT.","NOMBRE COMPLETO",null,"CLUB","CAT.","NOMBRE COMPLETO",null,"CLUB","CAT.","NOMBRE COMPLETO",null,"CLUB","CAT.","NOMBRE COMPLETO",null,"CLUB","CAT.","NOMBRE COMPLETO"]
[null,null,{"$f":"_xlfn._xlws.SORT(_xlfn._xlws.FILTER(FILTRADO,(Tabla12[CLUB]=C16)*(Tabla12[CAT.]=D16)),3,1)","v":{"$error":"#VALUE!"}},null,null,null,{"$f":"_xlfn._xlws.SORT(_xlfn._xlws.FILTER(FILTRADO,(Tabla12[CLUB]=G16)*(Tabla12[CAT.]=H16)),3,1)","v":{"$error":"#VALUE!"}},null,null,null,{"$f":"_xlfn._xlws.SORT(_xlfn._xlws.FILTER(FILTRADO,(Tabla12[CLUB]=K16)*(Tabla12[CAT.]=L16)),3,1)","v":{"$error":"#VALUE!"}},null,null,null,{"$f":"_xlfn._xlws.SORT(_xlfn._xlws.FILTER(FILTRADO,(Tabla12[CLUB]=O16)*(Tabla12[CAT.]=P16)),3,1)","v":{"$error":"#VALUE!"}},null,null,null,{"$f":"_xlfn._xlws.SORT(_xlfn._xlws.FILTER(FILTRADO,(Tabla12[CLUB]=S16)*(Tabla12[CAT.]=T16)),3,1)","v":{"$error":"#VALUE!"}},null,null,null,{"$f":"_xlfn._xlws.SORT(_xlfn._xlws.FILTER(FILTRADO,(Tabla12[CLUB]=W16)*(Tabla12[CAT.]=X16)),3,1)","v":{"$error":"#VALUE!"}},null,null,null,{"$f":"_xlfn._xlws.SORT(_xlfn._xlws.FILTER(FILTRADO,(Tabla12[CLUB]=AA16)*(Tabla12[CAT.]=AB16)),3,1)","v":{"$error":"#VALUE!"}}]

{"sheet":"COMPETICIONES2026","index":15,"n_rows":10,"n_cols":4,"rows_kept":10,"cut":false,"hidden":true,"merged":[]}
[]
[]
[]
[null,null,null,"COMPETICION 2026"]
[null,null,null,"CAMPEONATO DE ARAGON DE REMOERGOMETRO"]
[null,null,null,"2ª JORNADA JDEE 25-26 "]
[null,null,null,"CTO. ARAGON DE VELOCIDAD (1x/2x)"]
[null,null,null,"CTO DE ARAGÓN DE REMO OLÍMPICO (TODOS)"]
[null,null,null,"REGATA LA SANTA"]
[null,null,null,"REGATA DE YOLAS"]